Build started at 2026-10-07T15:24:11.436958
Main binary: /Users/jenkins/j/workspace/release/tarball/f5d3a58584/build/conda/envs/lsst-scipipe-14.0.0-rsp/bin/python3.13
Build Options: -Dbuildtype=release -Dprefix=/Users/jenkins/j/workspace/release/tarball/f5d3a58584/build/conda/envs/lsst-scipipe-14.0.0-rsp/share/eups/EupsBuildDir/Darwin/gauss2d_fit-g4e61e667d6+8f8e796466/gauss2d_fit-g4e61e667d6+8f8e796466/build-release -Dlibdir=lib
Python system: Darwin
The Meson build system
Version: 1.12.1
Source dir: /Users/jenkins/j/workspace/release/tarball/f5d3a58584/build/conda/envs/lsst-scipipe-14.0.0-rsp/share/eups/EupsBuildDir/Darwin/gauss2d_fit-g4e61e667d6+8f8e796466/gauss2d_fit-g4e61e667d6+8f8e796466
Build dir: /Users/jenkins/j/workspace/release/tarball/f5d3a58584/build/conda/envs/lsst-scipipe-14.0.0-rsp/share/eups/EupsBuildDir/Darwin/gauss2d_fit-g4e61e667d6+8f8e796466/gauss2d_fit-g4e61e667d6+8f8e796466/build-release
Build type: native build
Project name: libgauss2d_fit
Project version: 0.3.0
-----------
Detecting compiler via: `arm64-apple-darwin20.0.0-clang++ --version` -> 0
stdout:
clang version 21.1.8
Target: arm64-apple-darwin20.0.0
Thread model: posix
InstalledDir: /Users/jenkins/j/workspace/release/tarball/f5d3a58584/build/conda/envs/lsst-scipipe-14.0.0-rsp/bin
Configuration file: /Users/jenkins/j/workspace/release/tarball/f5d3a58584/build/conda/envs/lsst-scipipe-14.0.0-rsp/bin/arm64-apple-darwin-clang++.cfg
-----------
Running command: -x c++ -E -dM -
-----
-----------
Detecting linker via: `arm64-apple-darwin20.0.0-clang++ -Wl,--version -Wl,-headerpad_max_install_names -Wl,-dead_strip_dylibs -Wl,-rpath,/Users/jenkins/j/workspace/release/tarball/f5d3a58584/build/conda/envs/lsst-scipipe-14.0.0-rsp/lib -L/Users/jenkins/j/workspace/release/tarball/f5d3a58584/build/conda/envs/lsst-scipipe-14.0.0-rsp/lib -ftree-vectorize -fPIC -fstack-protector-strong -O2 -pipe -stdlib=libc++ -fvisibility-inlines-hidden -fmessage-length=0 -isystem /Users/jenkins/j/workspace/release/tarball/f5d3a58584/build/conda/envs/lsst-scipipe-14.0.0-rsp/include -D_FORTIFY_SOURCE=2 -DNDEBUG -isystem /Users/jenkins/j/workspace/release/tarball/f5d3a58584/build/conda/envs/lsst-scipipe-14.0.0-rsp/include -mmacosx-version-min=14-arm -mmacosx-version-min=11.0` -> 1
stderr:
ld: unknown option: --version
arm64-apple-darwin20.0: error: linker command failed with exit code 1 (use -v to see invocation)
-----------
-----------
Detecting Apple linker via: `arm64-apple-darwin20.0.0-clang++ -Wl,-v -Wl,-headerpad_max_install_names -Wl,-dead_strip_dylibs -Wl,-rpath,/Users/jenkins/j/workspace/release/tarball/f5d3a58584/build/conda/envs/lsst-scipipe-14.0.0-rsp/lib -L/Users/jenkins/j/workspace/release/tarball/f5d3a58584/build/conda/envs/lsst-scipipe-14.0.0-rsp/lib -ftree-vectorize -fPIC -fstack-protector-strong -O2 -pipe -stdlib=libc++ -fvisibility-inlines-hidden -fmessage-length=0 -isystem /Users/jenkins/j/workspace/release/tarball/f5d3a58584/build/conda/envs/lsst-scipipe-14.0.0-rsp/include -D_FORTIFY_SOURCE=2 -DNDEBUG -isystem /Users/jenkins/j/workspace/release/tarball/f5d3a58584/build/conda/envs/lsst-scipipe-14.0.0-rsp/include -mmacosx-version-min=14-arm -mmacosx-version-min=11.0` -> 1
stderr:
@(#)PROGRAM:ld  PROJECT:ld64-956.6
BUILD 06:05:53 Aug 26 2026
configured to support archs: armv6 armv7 armv7s arm64 arm64e arm64_32 i386 x86_64 x86_64h armv6m armv7k armv7m armv7em riscv32 (tvOS)
Library search paths:
	/Users/jenkins/j/workspace/release/tarball/f5d3a58584/build/conda/envs/lsst-scipipe-14.0.0-rsp/lib
	/Users/jenkins/j/workspace/release/tarball/f5d3a58584/build/conda/envs/lsst-scipipe-14.0.0-rsp/lib
	/Library/Developer/CommandLineTools/SDKs/MacOSX.sdk/usr/lib
Framework search paths:
	/Library/Developer/CommandLineTools/SDKs/MacOSX.sdk/System/Library/Frameworks/
Undefined symbols for architecture arm64:
  "_main", referenced from:
     implicit entry/start for main executable
ld: symbol(s) not found for architecture arm64
arm64-apple-darwin20.0: error: linker command failed with exit code 1 (use -v to see invocation)
-----------
Sanity check compiler command line: arm64-apple-darwin20.0.0-clang++ -o sanity_check_for_cpp.exe sanity_check_for_cpp.cpp -ftree-vectorize -fPIC -fstack-protector-strong -O2 -pipe -stdlib=libc++ -fvisibility-inlines-hidden -fmessage-length=0 -isystem /Users/jenkins/j/workspace/release/tarball/f5d3a58584/build/conda/envs/lsst-scipipe-14.0.0-rsp/include -D_FORTIFY_SOURCE=2 -DNDEBUG -isystem /Users/jenkins/j/workspace/release/tarball/f5d3a58584/build/conda/envs/lsst-scipipe-14.0.0-rsp/include -mmacosx-version-min=14-arm -mmacosx-version-min=11.0 -Wl,-headerpad_max_install_names -Wl,-dead_strip_dylibs -Wl,-rpath,/Users/jenkins/j/workspace/release/tarball/f5d3a58584/build/conda/envs/lsst-scipipe-14.0.0-rsp/lib -L/Users/jenkins/j/workspace/release/tarball/f5d3a58584/build/conda/envs/lsst-scipipe-14.0.0-rsp/lib
Sanity check compile stdout:

-----
Sanity check compile stderr:

-----
Sanity check built target output for host machine cpp compiler
 -- Running test binary command:  /Users/jenkins/j/workspace/release/tarball/f5d3a58584/build/conda/envs/lsst-scipipe-14.0.0-rsp/share/eups/EupsBuildDir/Darwin/gauss2d_fit-g4e61e667d6+8f8e796466/gauss2d_fit-g4e61e667d6+8f8e796466/build-release/meson-private/sanity_check_for_cpp.exe
-----------
Sanity check: `/Users/jenkins/j/workspace/release/tarball/f5d3a58584/build/conda/envs/lsst-scipipe-14.0.0-rsp/share/eups/EupsBuildDir/Darwin/gauss2d_fit-g4e61e667d6+8f8e796466/gauss2d_fit-g4e61e667d6+8f8e796466/build-release/meson-private/sanity_check_for_cpp.exe` -> 0
 -- stdout:
 
 -- stderr:
 
 -- returncode: 0
C++ compiler for the host machine: arm64-apple-darwin20.0.0-clang++ (clang 21.1.8 "clang version 21.1.8")
C++ linker for the host machine: arm64-apple-darwin20.0.0-clang++ ld64 956.6
-----------
Detecting archiver via: `arm64-apple-darwin20.0.0-ar --version` -> 1
stderr:
usage:  ar -d [-TLsv] archive file ...
	ar -m [-TLsv] archive file ...
	ar -m [-abiTLsv] position archive file ...
	ar -p [-TLsv] archive [file ...]
	ar -q [-cTLsv] archive file ...
	ar -r [-cuTLsv] archive file ...
	ar -r [-abciuTLsv] position archive file ...
	ar -t [-TLsv] archive [file ...]
	ar -x [-ouTLsv] archive [file ...]
-----------
-----------
Detecting compiler via: `arm64-apple-darwin20.0.0-clang++ --version` -> 0
stdout:
clang version 21.1.8
Target: arm64-apple-darwin20.0.0
Thread model: posix
InstalledDir: /Users/jenkins/j/workspace/release/tarball/f5d3a58584/build/conda/envs/lsst-scipipe-14.0.0-rsp/bin
Configuration file: /Users/jenkins/j/workspace/release/tarball/f5d3a58584/build/conda/envs/lsst-scipipe-14.0.0-rsp/bin/arm64-apple-darwin-clang++.cfg
-----------
Running command: -x c++ -E -dM -
-----
-----------
Detecting linker via: `arm64-apple-darwin20.0.0-clang++ -Wl,--version -Wl,-headerpad_max_install_names -Wl,-dead_strip_dylibs -Wl,-rpath,/Users/jenkins/j/workspace/release/tarball/f5d3a58584/build/conda/envs/lsst-scipipe-14.0.0-rsp/lib -L/Users/jenkins/j/workspace/release/tarball/f5d3a58584/build/conda/envs/lsst-scipipe-14.0.0-rsp/lib -ftree-vectorize -fPIC -fstack-protector-strong -O2 -pipe -stdlib=libc++ -fvisibility-inlines-hidden -fmessage-length=0 -isystem /Users/jenkins/j/workspace/release/tarball/f5d3a58584/build/conda/envs/lsst-scipipe-14.0.0-rsp/include -D_FORTIFY_SOURCE=2 -DNDEBUG -isystem /Users/jenkins/j/workspace/release/tarball/f5d3a58584/build/conda/envs/lsst-scipipe-14.0.0-rsp/include -mmacosx-version-min=14-arm -mmacosx-version-min=11.0` -> 1
stderr:
ld: unknown option: --version
arm64-apple-darwin20.0: error: linker command failed with exit code 1 (use -v to see invocation)
-----------
-----------
Detecting Apple linker via: `arm64-apple-darwin20.0.0-clang++ -Wl,-v -Wl,-headerpad_max_install_names -Wl,-dead_strip_dylibs -Wl,-rpath,/Users/jenkins/j/workspace/release/tarball/f5d3a58584/build/conda/envs/lsst-scipipe-14.0.0-rsp/lib -L/Users/jenkins/j/workspace/release/tarball/f5d3a58584/build/conda/envs/lsst-scipipe-14.0.0-rsp/lib -ftree-vectorize -fPIC -fstack-protector-strong -O2 -pipe -stdlib=libc++ -fvisibility-inlines-hidden -fmessage-length=0 -isystem /Users/jenkins/j/workspace/release/tarball/f5d3a58584/build/conda/envs/lsst-scipipe-14.0.0-rsp/include -D_FORTIFY_SOURCE=2 -DNDEBUG -isystem /Users/jenkins/j/workspace/release/tarball/f5d3a58584/build/conda/envs/lsst-scipipe-14.0.0-rsp/include -mmacosx-version-min=14-arm -mmacosx-version-min=11.0` -> 1
stderr:
@(#)PROGRAM:ld  PROJECT:ld64-956.6
BUILD 06:05:53 Aug 26 2026
configured to support archs: armv6 armv7 armv7s arm64 arm64e arm64_32 i386 x86_64 x86_64h armv6m armv7k armv7m armv7em riscv32 (tvOS)
Library search paths:
	/Users/jenkins/j/workspace/release/tarball/f5d3a58584/build/conda/envs/lsst-scipipe-14.0.0-rsp/lib
	/Users/jenkins/j/workspace/release/tarball/f5d3a58584/build/conda/envs/lsst-scipipe-14.0.0-rsp/lib
	/Library/Developer/CommandLineTools/SDKs/MacOSX.sdk/usr/lib
Framework search paths:
	/Library/Developer/CommandLineTools/SDKs/MacOSX.sdk/System/Library/Frameworks/
Undefined symbols for architecture arm64:
  "_main", referenced from:
     implicit entry/start for main executable
ld: symbol(s) not found for architecture arm64
arm64-apple-darwin20.0: error: linker command failed with exit code 1 (use -v to see invocation)
-----------
Sanity check compiler command line: arm64-apple-darwin20.0.0-clang++ -o sanity_check_for_cpp.exe sanity_check_for_cpp.cpp -ftree-vectorize -fPIC -fstack-protector-strong -O2 -pipe -stdlib=libc++ -fvisibility-inlines-hidden -fmessage-length=0 -isystem /Users/jenkins/j/workspace/release/tarball/f5d3a58584/build/conda/envs/lsst-scipipe-14.0.0-rsp/include -D_FORTIFY_SOURCE=2 -DNDEBUG -isystem /Users/jenkins/j/workspace/release/tarball/f5d3a58584/build/conda/envs/lsst-scipipe-14.0.0-rsp/include -mmacosx-version-min=14-arm -mmacosx-version-min=11.0 -Wl,-headerpad_max_install_names -Wl,-dead_strip_dylibs -Wl,-rpath,/Users/jenkins/j/workspace/release/tarball/f5d3a58584/build/conda/envs/lsst-scipipe-14.0.0-rsp/lib -L/Users/jenkins/j/workspace/release/tarball/f5d3a58584/build/conda/envs/lsst-scipipe-14.0.0-rsp/lib
Sanity check compile stdout:

-----
Sanity check compile stderr:

-----
Sanity check built target output for build machine cpp compiler
 -- Running test binary command:  /Users/jenkins/j/workspace/release/tarball/f5d3a58584/build/conda/envs/lsst-scipipe-14.0.0-rsp/share/eups/EupsBuildDir/Darwin/gauss2d_fit-g4e61e667d6+8f8e796466/gauss2d_fit-g4e61e667d6+8f8e796466/build-release/meson-private/sanity_check_for_cpp.exe
-----------
Sanity check: `/Users/jenkins/j/workspace/release/tarball/f5d3a58584/build/conda/envs/lsst-scipipe-14.0.0-rsp/share/eups/EupsBuildDir/Darwin/gauss2d_fit-g4e61e667d6+8f8e796466/gauss2d_fit-g4e61e667d6+8f8e796466/build-release/meson-private/sanity_check_for_cpp.exe` -> 0
 -- stdout:
 
 -- stderr:
 
 -- returncode: 0
C++ compiler for the build machine: arm64-apple-darwin20.0.0-clang++ (clang 21.1.8 "clang version 21.1.8")
C++ linker for the build machine: arm64-apple-darwin20.0.0-clang++ ld64 956.6
Build machine cpu family: aarch64
Build machine cpu: aarch64
Host machine cpu family: aarch64
Host machine cpu: aarch64
Target machine cpu family: aarch64
Target machine cpu: aarch64
Program eups found: YES (/Users/jenkins/j/workspace/release/tarball/f5d3a58584/build/conda/envs/lsst-scipipe-14.0.0-rsp/eups/bin/eups)
Running command: /Users/jenkins/j/workspace/release/tarball/f5d3a58584/build/conda/envs/lsst-scipipe-14.0.0-rsp/eups/bin/eups list gauss2d_fit
--- stdout ---
   LOCAL:/Users/jenkins/j/workspace/release/tarball/f5d3a58584/build/conda/envs/lsst-scipipe-14.0.0-rsp/share/eups/EupsBuildDir/Darwin/gauss2d_fit-g4e61e667d6+8f8e796466/gauss2d_fit-g4e61e667d6+8f8e796466 	setup

--- stderr ---


Pkg-config binary missing from cross or native file, or env var undefined.
Trying a default Pkg-config fallback at pkg-config
Found pkg-config: YES (/Users/jenkins/j/workspace/release/tarball/f5d3a58584/build/conda/envs/lsst-scipipe-14.0.0-rsp/bin/pkg-config) 0.29.2
Determining dependency 'gsl' with pkg-config executable '/Users/jenkins/j/workspace/release/tarball/f5d3a58584/build/conda/envs/lsst-scipipe-14.0.0-rsp/bin/pkg-config'
env[PKG_CONFIG_PATH_AARCH64_APPLE_DARWIN]: /Users/jenkins/j/workspace/release/tarball/f5d3a58584/build/conda/envs/lsst-scipipe-14.0.0-rsp/lib/pkgconfig
env[PKG_CONFIG_PATH]: 
env[PKG_CONFIG]: /Users/jenkins/j/workspace/release/tarball/f5d3a58584/build/conda/envs/lsst-scipipe-14.0.0-rsp/bin/pkg-config
-----------
Called: `/Users/jenkins/j/workspace/release/tarball/f5d3a58584/build/conda/envs/lsst-scipipe-14.0.0-rsp/bin/pkg-config --modversion gsl` -> 0
stdout:
2.7
-----------
env[PKG_CONFIG_PATH_AARCH64_APPLE_DARWIN]: /Users/jenkins/j/workspace/release/tarball/f5d3a58584/build/conda/envs/lsst-scipipe-14.0.0-rsp/lib/pkgconfig
env[PKG_CONFIG_PATH]: 
env[PKG_CONFIG]: /Users/jenkins/j/workspace/release/tarball/f5d3a58584/build/conda/envs/lsst-scipipe-14.0.0-rsp/bin/pkg-config
-----------
Called: `/Users/jenkins/j/workspace/release/tarball/f5d3a58584/build/conda/envs/lsst-scipipe-14.0.0-rsp/bin/pkg-config --cflags gsl` -> 0
stdout:
-I/Users/jenkins/j/workspace/release/tarball/f5d3a58584/build/conda/envs/lsst-scipipe-14.0.0-rsp/include
-----------
env[PKG_CONFIG_PATH_AARCH64_APPLE_DARWIN]: /Users/jenkins/j/workspace/release/tarball/f5d3a58584/build/conda/envs/lsst-scipipe-14.0.0-rsp/lib/pkgconfig
env[PKG_CONFIG_ALLOW_SYSTEM_LIBS]: 1
env[PKG_CONFIG_PATH]: 
env[PKG_CONFIG]: /Users/jenkins/j/workspace/release/tarball/f5d3a58584/build/conda/envs/lsst-scipipe-14.0.0-rsp/bin/pkg-config
-----------
Called: `/Users/jenkins/j/workspace/release/tarball/f5d3a58584/build/conda/envs/lsst-scipipe-14.0.0-rsp/bin/pkg-config --libs gsl` -> 0
stdout:
-L/Users/jenkins/j/workspace/release/tarball/f5d3a58584/build/conda/envs/lsst-scipipe-14.0.0-rsp/lib -lgsl -lgslcblas -lcblas -lm
-----------
env[PKG_CONFIG_PATH_AARCH64_APPLE_DARWIN]: /Users/jenkins/j/workspace/release/tarball/f5d3a58584/build/conda/envs/lsst-scipipe-14.0.0-rsp/lib/pkgconfig
env[PKG_CONFIG_PATH]: 
env[PKG_CONFIG]: /Users/jenkins/j/workspace/release/tarball/f5d3a58584/build/conda/envs/lsst-scipipe-14.0.0-rsp/bin/pkg-config
-----------
Called: `/Users/jenkins/j/workspace/release/tarball/f5d3a58584/build/conda/envs/lsst-scipipe-14.0.0-rsp/bin/pkg-config --libs gsl` -> 0
stdout:
-L/Users/jenkins/j/workspace/release/tarball/f5d3a58584/build/conda/envs/lsst-scipipe-14.0.0-rsp/lib -lgsl -lgslcblas -lcblas -lm
-----------
Running compile:
Working directory:  /Users/jenkins/j/workspace/release/tarball/f5d3a58584/build/conda/envs/lsst-scipipe-14.0.0-rsp/share/eups/EupsBuildDir/Darwin/gauss2d_fit-g4e61e667d6+8f8e796466/gauss2d_fit-g4e61e667d6+8f8e796466/build-release/meson-private/tmpagfy2wa4
Code:

        #include<stddef.h>
        #include<stdio.h>
        int main(void) {
            printf("%ld\n", (long)(sizeof(void *)));
            return 0;
        }
-----------
Command line: `arm64-apple-darwin20.0.0-clang++ -L/Users/jenkins/j/workspace/release/tarball/f5d3a58584/build/conda/envs/lsst-scipipe-14.0.0-rsp/lib /Users/jenkins/j/workspace/release/tarball/f5d3a58584/build/conda/envs/lsst-scipipe-14.0.0-rsp/share/eups/EupsBuildDir/Darwin/gauss2d_fit-g4e61e667d6+8f8e796466/gauss2d_fit-g4e61e667d6+8f8e796466/build-release/meson-private/tmpagfy2wa4/testfile.cpp -o /Users/jenkins/j/workspace/release/tarball/f5d3a58584/build/conda/envs/lsst-scipipe-14.0.0-rsp/share/eups/EupsBuildDir/Darwin/gauss2d_fit-g4e61e667d6+8f8e796466/gauss2d_fit-g4e61e667d6+8f8e796466/build-release/meson-private/tmpagfy2wa4/output.exe -ftree-vectorize -fPIC -fstack-protector-strong -O2 -pipe -stdlib=libc++ -fvisibility-inlines-hidden -fmessage-length=0 -D_FORTIFY_SOURCE=2 -DNDEBUG -mmacosx-version-min=14-arm -mmacosx-version-min=11.0 -O0 -U_FORTIFY_SOURCE -fpermissive -Werror=implicit-function-declaration -Wl,-headerpad_max_install_names -Wl,-dead_strip_dylibs -Wl,-rpath,/Users/jenkins/j/workspace/release/tarball/f5d3a58584/build/conda/envs/lsst-scipipe-14.0.0-rsp/lib` -> 0
Program stdout:

8

Program stderr:


Running compile:
Working directory:  /Users/jenkins/j/workspace/release/tarball/f5d3a58584/build/conda/envs/lsst-scipipe-14.0.0-rsp/share/eups/EupsBuildDir/Darwin/gauss2d_fit-g4e61e667d6+8f8e796466/gauss2d_fit-g4e61e667d6+8f8e796466/build-release/meson-private/tmpntbwke9q
Code:

-----------
Command line: `arm64-apple-darwin20.0.0-clang++ /Users/jenkins/j/workspace/release/tarball/f5d3a58584/build/conda/envs/lsst-scipipe-14.0.0-rsp/share/eups/EupsBuildDir/Darwin/gauss2d_fit-g4e61e667d6+8f8e796466/gauss2d_fit-g4e61e667d6+8f8e796466/build-release/meson-private/tmpntbwke9q/testfile.cpp -o /Users/jenkins/j/workspace/release/tarball/f5d3a58584/build/conda/envs/lsst-scipipe-14.0.0-rsp/share/eups/EupsBuildDir/Darwin/gauss2d_fit-g4e61e667d6+8f8e796466/gauss2d_fit-g4e61e667d6+8f8e796466/build-release/meson-private/tmpntbwke9q/output.obj -c -ftree-vectorize -fPIC -fstack-protector-strong -O2 -pipe -stdlib=libc++ -fvisibility-inlines-hidden -fmessage-length=0 -D_FORTIFY_SOURCE=2 -DNDEBUG -mmacosx-version-min=14-arm -mmacosx-version-min=11.0 -O0 -U_FORTIFY_SOURCE -fpermissive -Werror=implicit-function-declaration -Werror=unknown-warning-option -Werror=unused-command-line-argument -Werror=ignored-optimization-argument --print-search-dirs` -> 0
stdout:
programs: =/Users/jenkins/j/workspace/release/tarball/f5d3a58584/build/conda/envs/lsst-scipipe-14.0.0-rsp/bin
libraries: =/Users/jenkins/j/workspace/release/tarball/f5d3a58584/build/conda/envs/lsst-scipipe-14.0.0-rsp/lib/clang/21
-----------
Running compile:
Working directory:  /Users/jenkins/j/workspace/release/tarball/f5d3a58584/build/conda/envs/lsst-scipipe-14.0.0-rsp/share/eups/EupsBuildDir/Darwin/gauss2d_fit-g4e61e667d6+8f8e796466/gauss2d_fit-g4e61e667d6+8f8e796466/build-release/meson-private/tmptbsyai3p
Code:
int main(void) { return 0; }

-----------
Command line: `arm64-apple-darwin20.0.0-clang++ -L/Users/jenkins/j/workspace/release/tarball/f5d3a58584/build/conda/envs/lsst-scipipe-14.0.0-rsp/lib /Users/jenkins/j/workspace/release/tarball/f5d3a58584/build/conda/envs/lsst-scipipe-14.0.0-rsp/share/eups/EupsBuildDir/Darwin/gauss2d_fit-g4e61e667d6+8f8e796466/gauss2d_fit-g4e61e667d6+8f8e796466/build-release/meson-private/tmptbsyai3p/testfile.cpp -o /Users/jenkins/j/workspace/release/tarball/f5d3a58584/build/conda/envs/lsst-scipipe-14.0.0-rsp/share/eups/EupsBuildDir/Darwin/gauss2d_fit-g4e61e667d6+8f8e796466/gauss2d_fit-g4e61e667d6+8f8e796466/build-release/meson-private/tmptbsyai3p/output.exe -ftree-vectorize -fPIC -fstack-protector-strong -O2 -pipe -stdlib=libc++ -fvisibility-inlines-hidden -fmessage-length=0 -D_FORTIFY_SOURCE=2 -DNDEBUG -mmacosx-version-min=14-arm -mmacosx-version-min=11.0 -O0 -U_FORTIFY_SOURCE -fpermissive -Werror=implicit-function-declaration -lm -Wl,-undefined,dynamic_lookup -Wl,-headerpad_max_install_names -Wl,-dead_strip_dylibs -Wl,-rpath,/Users/jenkins/j/workspace/release/tarball/f5d3a58584/build/conda/envs/lsst-scipipe-14.0.0-rsp/lib` -> 0
Run-time dependency gsl found: YES 2.7
Running command: /bin/sh -c 'echo $GAUSS2D_DIR'
--- stdout ---
/Users/jenkins/j/workspace/release/tarball/f5d3a58584/build/conda/envs/lsst-scipipe-14.0.0-rsp/share/eups/Darwin/gauss2d/gb90b002fd1+663e2227e0

--- stderr ---


Running compile:
Working directory:  /Users/jenkins/j/workspace/release/tarball/f5d3a58584/build/conda/envs/lsst-scipipe-14.0.0-rsp/share/eups/EupsBuildDir/Darwin/gauss2d_fit-g4e61e667d6+8f8e796466/gauss2d_fit-g4e61e667d6+8f8e796466/build-release/meson-private/tmpw7kh6o46
Code:
int main(void) { return 0; }

-----------
Command line: `arm64-apple-darwin20.0.0-clang++ -L/Users/jenkins/j/workspace/release/tarball/f5d3a58584/build/conda/envs/lsst-scipipe-14.0.0-rsp/lib /Users/jenkins/j/workspace/release/tarball/f5d3a58584/build/conda/envs/lsst-scipipe-14.0.0-rsp/share/eups/EupsBuildDir/Darwin/gauss2d_fit-g4e61e667d6+8f8e796466/gauss2d_fit-g4e61e667d6+8f8e796466/build-release/meson-private/tmpw7kh6o46/testfile.cpp -o /Users/jenkins/j/workspace/release/tarball/f5d3a58584/build/conda/envs/lsst-scipipe-14.0.0-rsp/share/eups/EupsBuildDir/Darwin/gauss2d_fit-g4e61e667d6+8f8e796466/gauss2d_fit-g4e61e667d6+8f8e796466/build-release/meson-private/tmpw7kh6o46/output.exe -ftree-vectorize -fPIC -fstack-protector-strong -O2 -pipe -stdlib=libc++ -fvisibility-inlines-hidden -fmessage-length=0 -D_FORTIFY_SOURCE=2 -DNDEBUG -mmacosx-version-min=14-arm -mmacosx-version-min=11.0 -O0 -U_FORTIFY_SOURCE -fpermissive -Werror=implicit-function-declaration /Users/jenkins/j/workspace/release/tarball/f5d3a58584/build/conda/envs/lsst-scipipe-14.0.0-rsp/share/eups/Darwin/gauss2d/gb90b002fd1+663e2227e0/build-release/lib/lsst/libgauss2d.dylib -Wl,-undefined,dynamic_lookup -shared -Wl,-headerpad_max_install_names -Wl,-dead_strip_dylibs -Wl,-rpath,/Users/jenkins/j/workspace/release/tarball/f5d3a58584/build/conda/envs/lsst-scipipe-14.0.0-rsp/lib` -> 0
Library gauss2d found: YES
Running command: /bin/sh -c 'echo $MODELFIT_PARAMETERS_DIR'
--- stdout ---
/Users/jenkins/j/workspace/release/tarball/f5d3a58584/build/conda/envs/lsst-scipipe-14.0.0-rsp/share/eups/Darwin/modelfit_parameters/g35bb328faa+663e2227e0

--- stderr ---


Running compile:
Working directory:  /Users/jenkins/j/workspace/release/tarball/f5d3a58584/build/conda/envs/lsst-scipipe-14.0.0-rsp/share/eups/EupsBuildDir/Darwin/gauss2d_fit-g4e61e667d6+8f8e796466/gauss2d_fit-g4e61e667d6+8f8e796466/build-release/meson-private/tmptfx3fa2x
Code:

        #ifdef __has_include
         #if !__has_include("version")
          #error "Header 'version' could not be found"
         #endif
        #else
         #include <version>
        #endif
-----------
Command line: `arm64-apple-darwin20.0.0-clang++ /Users/jenkins/j/workspace/release/tarball/f5d3a58584/build/conda/envs/lsst-scipipe-14.0.0-rsp/share/eups/EupsBuildDir/Darwin/gauss2d_fit-g4e61e667d6+8f8e796466/gauss2d_fit-g4e61e667d6+8f8e796466/build-release/meson-private/tmptfx3fa2x/testfile.cpp -E -P -ftree-vectorize -fPIC -fstack-protector-strong -O2 -pipe -stdlib=libc++ -fvisibility-inlines-hidden -fmessage-length=0 -D_FORTIFY_SOURCE=2 -DNDEBUG -mmacosx-version-min=14-arm -mmacosx-version-min=11.0 -P -O0 -U_FORTIFY_SOURCE -fpermissive -Werror=implicit-function-declaration` -> 0
Running compile:
Working directory:  /Users/jenkins/j/workspace/release/tarball/f5d3a58584/build/conda/envs/lsst-scipipe-14.0.0-rsp/share/eups/EupsBuildDir/Darwin/gauss2d_fit-g4e61e667d6+8f8e796466/gauss2d_fit-g4e61e667d6+8f8e796466/build-release/meson-private/tmpi2g1p104
Code:

        #include <version>
        int main(void) {
            /* If it's not defined as a macro, try to use as a symbol */
            #ifndef _LIBCPP_VERSION
                _LIBCPP_VERSION;
            #endif
            return 0;
        }
-----------
Command line: `arm64-apple-darwin20.0.0-clang++ /Users/jenkins/j/workspace/release/tarball/f5d3a58584/build/conda/envs/lsst-scipipe-14.0.0-rsp/share/eups/EupsBuildDir/Darwin/gauss2d_fit-g4e61e667d6+8f8e796466/gauss2d_fit-g4e61e667d6+8f8e796466/build-release/meson-private/tmpi2g1p104/testfile.cpp -o /Users/jenkins/j/workspace/release/tarball/f5d3a58584/build/conda/envs/lsst-scipipe-14.0.0-rsp/share/eups/EupsBuildDir/Darwin/gauss2d_fit-g4e61e667d6+8f8e796466/gauss2d_fit-g4e61e667d6+8f8e796466/build-release/meson-private/tmpi2g1p104/output.obj -c -ftree-vectorize -fPIC -fstack-protector-strong -O2 -pipe -stdlib=libc++ -fvisibility-inlines-hidden -fmessage-length=0 -D_FORTIFY_SOURCE=2 -DNDEBUG -mmacosx-version-min=14-arm -mmacosx-version-min=11.0 -O0 -U_FORTIFY_SOURCE -fpermissive -Werror=implicit-function-declaration -Werror=unknown-warning-option -Werror=unused-command-line-argument -Werror=ignored-optimization-argument` -> 0
Adding test "centroidparameters"
Adding test "channel"
Adding test "data"
Adding test "fractionalintegralmodel"
Adding test "gaussiancomponent"
Adding test "gaussianparametricellipse"
Adding test "gaussianprior"
Adding test "gslinterpolator"
Adding test "gslsersicmixinterpolator"
Adding test "linearintegralmodel"
Adding test "linearsersicmixinterpolator"
Adding test "model"
Adding test "observation"
Adding test "parametricgaussian1d"
Adding test "psfmodel"
Adding test "sersicmix"
Adding test "sersicmixcomponent"
Adding test "shapeprior"
Adding test "source"
Build targets in project: 20

libgauss2d_fit 0.3.0

  User defined options
    buildtype: release
    libdir   : lib
    prefix   : /Users/jenkins/j/workspace/release/tarball/f5d3a58584/build/conda/envs/lsst-scipipe-14.0.0-rsp/share/eups/EupsBuildDir/Darwin/gauss2d_fit-g4e61e667d6+8f8e796466/gauss2d_fit-g4e61e667d6+8f8e796466/build-release

Found ninja-1.13.2 at /Users/jenkins/j/workspace/release/tarball/f5d3a58584/build/conda/envs/lsst-scipipe-14.0.0-rsp/bin/ninja
Running compile:
Working directory:  /var/folders/9x/708ytvk10xdg3t5rj3q17jdr0000gp/T/tmp38go_254
Code:
int i = static_cast<int>(0);
-----------
Command line: `arm64-apple-darwin20.0.0-clang++ /var/folders/9x/708ytvk10xdg3t5rj3q17jdr0000gp/T/tmp38go_254/testfile.cpp -o /var/folders/9x/708ytvk10xdg3t5rj3q17jdr0000gp/T/tmp38go_254/output.obj -c -std=c++20` -> 0
Compiler accepts -std=c++20: YES
!meson_ci!/ci_include "/Users/jenkins/j/workspace/release/tarball/f5d3a58584/build/conda/envs/lsst-scipipe-14.0.0-rsp/share/eups/EupsBuildDir/Darwin/gauss2d_fit-g4e61e667d6+8f8e796466/gauss2d_fit-g4e61e667d6+8f8e796466/build-release/build.ninja"
