Build started at 2026-02-14T01:36:56.995297
Main binary: /Users/jenkins/j/workspace/release/tarball/eb40a89f6a/build/conda/envs/lsst-scipipe-12.1.0/bin/python3.13
Build Options: -Dprefix=/Users/jenkins/j/workspace/release/tarball/eb40a89f6a/build/conda/envs/lsst-scipipe-12.1.0/share/eups/EupsBuildDir/Darwin/gauss2d_fit-g199a45376c+f63862d77a/gauss2d_fit-g199a45376c+f63862d77a/build-release -Dlibdir=lib -Dbuildtype=release
Python system: Darwin
The Meson build system
Version: 1.10.1
Source dir: /Users/jenkins/j/workspace/release/tarball/eb40a89f6a/build/conda/envs/lsst-scipipe-12.1.0/share/eups/EupsBuildDir/Darwin/gauss2d_fit-g199a45376c+f63862d77a/gauss2d_fit-g199a45376c+f63862d77a
Build dir: /Users/jenkins/j/workspace/release/tarball/eb40a89f6a/build/conda/envs/lsst-scipipe-12.1.0/share/eups/EupsBuildDir/Darwin/gauss2d_fit-g199a45376c+f63862d77a/gauss2d_fit-g199a45376c+f63862d77a/build-release
Build type: native build
Project name: libgauss2d_fit
Project version: 0.3.0
-----------
Detecting compiler via: `arm64-apple-darwin20.0.0-clang++ --version` -> 0
stdout:
clang version 19.1.7
Target: arm64-apple-darwin20.0.0
Thread model: posix
InstalledDir: /Users/jenkins/j/workspace/release/tarball/eb40a89f6a/build/conda/envs/lsst-scipipe-12.1.0/bin
-----------
Running command: -x c++ -E -dM -
-----
-----------
Detecting linker via: `arm64-apple-darwin20.0.0-clang++ -Wl,--version -Wl,-headerpad_max_install_names -Wl,-dead_strip_dylibs -Wl,-rpath,/Users/jenkins/j/workspace/release/tarball/eb40a89f6a/build/conda/envs/lsst-scipipe-12.1.0/lib -L/Users/jenkins/j/workspace/release/tarball/eb40a89f6a/build/conda/envs/lsst-scipipe-12.1.0/lib -ftree-vectorize -fPIC -fstack-protector-strong -O2 -pipe -stdlib=libc++ -fvisibility-inlines-hidden -fmessage-length=0 -isystem /Users/jenkins/j/workspace/release/tarball/eb40a89f6a/build/conda/envs/lsst-scipipe-12.1.0/include -D_FORTIFY_SOURCE=2 -isystem /Users/jenkins/j/workspace/release/tarball/eb40a89f6a/build/conda/envs/lsst-scipipe-12.1.0/include -mmacosx-version-min=14-arm -mmacosx-version-min=11.0` -> 1
stderr:
ld: unknown option: --version
arm64-apple-darwin20.0: error: linker command failed with exit code 1 (use -v to see invocation)
-----------
-----------
Detecting Apple linker via: `arm64-apple-darwin20.0.0-clang++ -Wl,-v -Wl,-headerpad_max_install_names -Wl,-dead_strip_dylibs -Wl,-rpath,/Users/jenkins/j/workspace/release/tarball/eb40a89f6a/build/conda/envs/lsst-scipipe-12.1.0/lib -L/Users/jenkins/j/workspace/release/tarball/eb40a89f6a/build/conda/envs/lsst-scipipe-12.1.0/lib -ftree-vectorize -fPIC -fstack-protector-strong -O2 -pipe -stdlib=libc++ -fvisibility-inlines-hidden -fmessage-length=0 -isystem /Users/jenkins/j/workspace/release/tarball/eb40a89f6a/build/conda/envs/lsst-scipipe-12.1.0/include -D_FORTIFY_SOURCE=2 -isystem /Users/jenkins/j/workspace/release/tarball/eb40a89f6a/build/conda/envs/lsst-scipipe-12.1.0/include -mmacosx-version-min=14-arm -mmacosx-version-min=11.0` -> 1
stderr:
@(#)PROGRAM:ld  PROJECT:ld64-956.6
BUILD 19:57:54 Jan 19 2026
configured to support archs: armv6 armv7 armv7s arm64 arm64e arm64_32 i386 x86_64 x86_64h armv6m armv7k armv7m armv7em riscv32 (tvOS)
Library search paths:
	/Users/jenkins/j/workspace/release/tarball/eb40a89f6a/build/conda/envs/lsst-scipipe-12.1.0/lib
	/Library/Developer/CommandLineTools/SDKs/MacOSX.sdk/usr/lib
Framework search paths:
	/Library/Developer/CommandLineTools/SDKs/MacOSX.sdk/System/Library/Frameworks/
Undefined symbols for architecture arm64:
  "_main", referenced from:
     implicit entry/start for main executable
ld: symbol(s) not found for architecture arm64
arm64-apple-darwin20.0: error: linker command failed with exit code 1 (use -v to see invocation)
-----------
Sanity testing C++ compiler: arm64-apple-darwin20.0.0-clang++
Is cross compiler: False.
Sanity check compiler command line: arm64-apple-darwin20.0.0-clang++ sanitycheckcpp.cc -o sanitycheckcpp.exe -ftree-vectorize -fPIC -fstack-protector-strong -O2 -pipe -stdlib=libc++ -fvisibility-inlines-hidden -fmessage-length=0 -isystem /Users/jenkins/j/workspace/release/tarball/eb40a89f6a/build/conda/envs/lsst-scipipe-12.1.0/include -D_FORTIFY_SOURCE=2 -isystem /Users/jenkins/j/workspace/release/tarball/eb40a89f6a/build/conda/envs/lsst-scipipe-12.1.0/include -mmacosx-version-min=14-arm -mmacosx-version-min=11.0 -Wl,-headerpad_max_install_names -Wl,-dead_strip_dylibs -Wl,-rpath,/Users/jenkins/j/workspace/release/tarball/eb40a89f6a/build/conda/envs/lsst-scipipe-12.1.0/lib -L/Users/jenkins/j/workspace/release/tarball/eb40a89f6a/build/conda/envs/lsst-scipipe-12.1.0/lib
Sanity check compile stdout:

-----
Sanity check compile stderr:

-----
Running test binary command:  /Users/jenkins/j/workspace/release/tarball/eb40a89f6a/build/conda/envs/lsst-scipipe-12.1.0/share/eups/EupsBuildDir/Darwin/gauss2d_fit-g199a45376c+f63862d77a/gauss2d_fit-g199a45376c+f63862d77a/build-release/meson-private/sanitycheckcpp.exe
-----------
Sanity check: `/Users/jenkins/j/workspace/release/tarball/eb40a89f6a/build/conda/envs/lsst-scipipe-12.1.0/share/eups/EupsBuildDir/Darwin/gauss2d_fit-g199a45376c+f63862d77a/gauss2d_fit-g199a45376c+f63862d77a/build-release/meson-private/sanitycheckcpp.exe` -> 0
C++ compiler for the host machine: arm64-apple-darwin20.0.0-clang++ (clang 19.1.7 "clang version 19.1.7")
C++ linker for the host machine: arm64-apple-darwin20.0.0-clang++ ld64 956.6
-----------
Detecting archiver via: `arm64-apple-darwin20.0.0-ar --version` -> 1
stderr:
usage:  ar -d [-TLsv] archive file ...
	ar -m [-TLsv] archive file ...
	ar -m [-abiTLsv] position archive file ...
	ar -p [-TLsv] archive [file ...]
	ar -q [-cTLsv] archive file ...
	ar -r [-cuTLsv] archive file ...
	ar -r [-abciuTLsv] position archive file ...
	ar -t [-TLsv] archive [file ...]
	ar -x [-ouTLsv] archive [file ...]
-----------
-----------
Detecting compiler via: `arm64-apple-darwin20.0.0-clang++ --version` -> 0
stdout:
clang version 19.1.7
Target: arm64-apple-darwin20.0.0
Thread model: posix
InstalledDir: /Users/jenkins/j/workspace/release/tarball/eb40a89f6a/build/conda/envs/lsst-scipipe-12.1.0/bin
-----------
Running command: -x c++ -E -dM -
-----
-----------
Detecting linker via: `arm64-apple-darwin20.0.0-clang++ -Wl,--version -Wl,-headerpad_max_install_names -Wl,-dead_strip_dylibs -Wl,-rpath,/Users/jenkins/j/workspace/release/tarball/eb40a89f6a/build/conda/envs/lsst-scipipe-12.1.0/lib -L/Users/jenkins/j/workspace/release/tarball/eb40a89f6a/build/conda/envs/lsst-scipipe-12.1.0/lib -ftree-vectorize -fPIC -fstack-protector-strong -O2 -pipe -stdlib=libc++ -fvisibility-inlines-hidden -fmessage-length=0 -isystem /Users/jenkins/j/workspace/release/tarball/eb40a89f6a/build/conda/envs/lsst-scipipe-12.1.0/include -D_FORTIFY_SOURCE=2 -isystem /Users/jenkins/j/workspace/release/tarball/eb40a89f6a/build/conda/envs/lsst-scipipe-12.1.0/include -mmacosx-version-min=14-arm -mmacosx-version-min=11.0` -> 1
stderr:
ld: unknown option: --version
arm64-apple-darwin20.0: error: linker command failed with exit code 1 (use -v to see invocation)
-----------
-----------
Detecting Apple linker via: `arm64-apple-darwin20.0.0-clang++ -Wl,-v -Wl,-headerpad_max_install_names -Wl,-dead_strip_dylibs -Wl,-rpath,/Users/jenkins/j/workspace/release/tarball/eb40a89f6a/build/conda/envs/lsst-scipipe-12.1.0/lib -L/Users/jenkins/j/workspace/release/tarball/eb40a89f6a/build/conda/envs/lsst-scipipe-12.1.0/lib -ftree-vectorize -fPIC -fstack-protector-strong -O2 -pipe -stdlib=libc++ -fvisibility-inlines-hidden -fmessage-length=0 -isystem /Users/jenkins/j/workspace/release/tarball/eb40a89f6a/build/conda/envs/lsst-scipipe-12.1.0/include -D_FORTIFY_SOURCE=2 -isystem /Users/jenkins/j/workspace/release/tarball/eb40a89f6a/build/conda/envs/lsst-scipipe-12.1.0/include -mmacosx-version-min=14-arm -mmacosx-version-min=11.0` -> 1
stderr:
@(#)PROGRAM:ld  PROJECT:ld64-956.6
BUILD 19:57:54 Jan 19 2026
configured to support archs: armv6 armv7 armv7s arm64 arm64e arm64_32 i386 x86_64 x86_64h armv6m armv7k armv7m armv7em riscv32 (tvOS)
Library search paths:
	/Users/jenkins/j/workspace/release/tarball/eb40a89f6a/build/conda/envs/lsst-scipipe-12.1.0/lib
	/Library/Developer/CommandLineTools/SDKs/MacOSX.sdk/usr/lib
Framework search paths:
	/Library/Developer/CommandLineTools/SDKs/MacOSX.sdk/System/Library/Frameworks/
Undefined symbols for architecture arm64:
  "_main", referenced from:
     implicit entry/start for main executable
ld: symbol(s) not found for architecture arm64
arm64-apple-darwin20.0: error: linker command failed with exit code 1 (use -v to see invocation)
-----------
Sanity testing C++ compiler: arm64-apple-darwin20.0.0-clang++
Is cross compiler: False.
Sanity check compiler command line: arm64-apple-darwin20.0.0-clang++ sanitycheckcpp.cc -o sanitycheckcpp.exe -ftree-vectorize -fPIC -fstack-protector-strong -O2 -pipe -stdlib=libc++ -fvisibility-inlines-hidden -fmessage-length=0 -isystem /Users/jenkins/j/workspace/release/tarball/eb40a89f6a/build/conda/envs/lsst-scipipe-12.1.0/include -D_FORTIFY_SOURCE=2 -isystem /Users/jenkins/j/workspace/release/tarball/eb40a89f6a/build/conda/envs/lsst-scipipe-12.1.0/include -mmacosx-version-min=14-arm -mmacosx-version-min=11.0 -Wl,-headerpad_max_install_names -Wl,-dead_strip_dylibs -Wl,-rpath,/Users/jenkins/j/workspace/release/tarball/eb40a89f6a/build/conda/envs/lsst-scipipe-12.1.0/lib -L/Users/jenkins/j/workspace/release/tarball/eb40a89f6a/build/conda/envs/lsst-scipipe-12.1.0/lib
Sanity check compile stdout:

-----
Sanity check compile stderr:

-----
Running test binary command:  /Users/jenkins/j/workspace/release/tarball/eb40a89f6a/build/conda/envs/lsst-scipipe-12.1.0/share/eups/EupsBuildDir/Darwin/gauss2d_fit-g199a45376c+f63862d77a/gauss2d_fit-g199a45376c+f63862d77a/build-release/meson-private/sanitycheckcpp.exe
-----------
Sanity check: `/Users/jenkins/j/workspace/release/tarball/eb40a89f6a/build/conda/envs/lsst-scipipe-12.1.0/share/eups/EupsBuildDir/Darwin/gauss2d_fit-g199a45376c+f63862d77a/gauss2d_fit-g199a45376c+f63862d77a/build-release/meson-private/sanitycheckcpp.exe` -> 0
C++ compiler for the build machine: arm64-apple-darwin20.0.0-clang++ (clang 19.1.7 "clang version 19.1.7")
C++ linker for the build machine: arm64-apple-darwin20.0.0-clang++ ld64 956.6
-----------
Detecting archiver via: `arm64-apple-darwin20.0.0-ar --version` -> 1
stderr:
usage:  ar -d [-TLsv] archive file ...
	ar -m [-TLsv] archive file ...
	ar -m [-abiTLsv] position archive file ...
	ar -p [-TLsv] archive [file ...]
	ar -q [-cTLsv] archive file ...
	ar -r [-cuTLsv] archive file ...
	ar -r [-abciuTLsv] position archive file ...
	ar -t [-TLsv] archive [file ...]
	ar -x [-ouTLsv] archive [file ...]
-----------
Build machine cpu family: aarch64
Build machine cpu: aarch64
Host machine cpu family: aarch64
Host machine cpu: aarch64
Target machine cpu family: aarch64
Target machine cpu: aarch64
Program eups found: YES (/Users/jenkins/j/workspace/release/tarball/eb40a89f6a/build/conda/envs/lsst-scipipe-12.1.0/eups/bin/eups)
Running command: /Users/jenkins/j/workspace/release/tarball/eb40a89f6a/build/conda/envs/lsst-scipipe-12.1.0/eups/bin/eups list gauss2d_fit
--- stdout ---
   LOCAL:/Users/jenkins/j/workspace/release/tarball/eb40a89f6a/build/conda/envs/lsst-scipipe-12.1.0/share/eups/EupsBuildDir/Darwin/gauss2d_fit-g199a45376c+f63862d77a/gauss2d_fit-g199a45376c+f63862d77a 	setup
   g199a45376c+0658834863 	d_2026_02_06 w_2026_04 w_2026_06 d_2026_02_04 d_latest current d_2026_01_30 d_2026_02_02 w_2026_07 d_2026_02_07 w_2026_05 d_2026_01_28 w_latest d_2026_01_31 d_2026_02_03 d_2026_02_01 d_2026_01_26 d_2026_01_24 d_2026_02_09 d_2026_02_10 d_2026_01_25 d_2026_01_27 d_2026_01_23 d_2026_02_11 d_2026_02_13
   g199a45376c+5137f08352 	v30_0_1_rc1 v30_0_0_rc2 w_2025_51 w_2025_48 w_2026_02 v30_0_0_rc1 v30_0_0_rc3 w_2026_01 w_2025_52 o_latest w_2025_50 w_2026_03 w_2025_49 v30_0_3_rc1 w_2025_47 v30_0_3 v30_0_1 w_2025_46 v30_0_0 v30_0_2

--- stderr ---


Pkg-config binary missing from cross or native file, or env var undefined.
Trying a default Pkg-config fallback at pkg-config
Found pkg-config: YES (/Users/jenkins/j/workspace/release/tarball/eb40a89f6a/build/conda/envs/lsst-scipipe-12.1.0/bin/pkg-config) 0.29.2
Determining dependency 'gsl' with pkg-config executable '/Users/jenkins/j/workspace/release/tarball/eb40a89f6a/build/conda/envs/lsst-scipipe-12.1.0/bin/pkg-config'
env[PKG_CONFIG_PATH_AARCH64_APPLE_DARWIN]: /Users/jenkins/j/workspace/release/tarball/eb40a89f6a/build/conda/envs/lsst-scipipe-12.1.0/lib/pkgconfig
env[PKG_CONFIG_PATH]: 
env[PKG_CONFIG]: /Users/jenkins/j/workspace/release/tarball/eb40a89f6a/build/conda/envs/lsst-scipipe-12.1.0/bin/pkg-config
-----------
Called: `/Users/jenkins/j/workspace/release/tarball/eb40a89f6a/build/conda/envs/lsst-scipipe-12.1.0/bin/pkg-config --modversion gsl` -> 0
stdout:
2.7
-----------
env[PKG_CONFIG_PATH_AARCH64_APPLE_DARWIN]: /Users/jenkins/j/workspace/release/tarball/eb40a89f6a/build/conda/envs/lsst-scipipe-12.1.0/lib/pkgconfig
env[PKG_CONFIG_PATH]: 
env[PKG_CONFIG]: /Users/jenkins/j/workspace/release/tarball/eb40a89f6a/build/conda/envs/lsst-scipipe-12.1.0/bin/pkg-config
-----------
Called: `/Users/jenkins/j/workspace/release/tarball/eb40a89f6a/build/conda/envs/lsst-scipipe-12.1.0/bin/pkg-config --cflags gsl` -> 0
stdout:
-I/Users/jenkins/j/workspace/release/tarball/eb40a89f6a/build/conda/envs/lsst-scipipe-12.1.0/include
-----------
env[PKG_CONFIG_PATH_AARCH64_APPLE_DARWIN]: /Users/jenkins/j/workspace/release/tarball/eb40a89f6a/build/conda/envs/lsst-scipipe-12.1.0/lib/pkgconfig
env[PKG_CONFIG_ALLOW_SYSTEM_LIBS]: 1
env[PKG_CONFIG_PATH]: 
env[PKG_CONFIG]: /Users/jenkins/j/workspace/release/tarball/eb40a89f6a/build/conda/envs/lsst-scipipe-12.1.0/bin/pkg-config
-----------
Called: `/Users/jenkins/j/workspace/release/tarball/eb40a89f6a/build/conda/envs/lsst-scipipe-12.1.0/bin/pkg-config --libs gsl` -> 0
stdout:
-L/Users/jenkins/j/workspace/release/tarball/eb40a89f6a/build/conda/envs/lsst-scipipe-12.1.0/lib -lgsl -lgslcblas -lcblas -lm
-----------
env[PKG_CONFIG_PATH_AARCH64_APPLE_DARWIN]: /Users/jenkins/j/workspace/release/tarball/eb40a89f6a/build/conda/envs/lsst-scipipe-12.1.0/lib/pkgconfig
env[PKG_CONFIG_PATH]: 
env[PKG_CONFIG]: /Users/jenkins/j/workspace/release/tarball/eb40a89f6a/build/conda/envs/lsst-scipipe-12.1.0/bin/pkg-config
-----------
Called: `/Users/jenkins/j/workspace/release/tarball/eb40a89f6a/build/conda/envs/lsst-scipipe-12.1.0/bin/pkg-config --libs gsl` -> 0
stdout:
-L/Users/jenkins/j/workspace/release/tarball/eb40a89f6a/build/conda/envs/lsst-scipipe-12.1.0/lib -lgsl -lgslcblas -lcblas -lm
-----------
Running compile:
Working directory:  /Users/jenkins/j/workspace/release/tarball/eb40a89f6a/build/conda/envs/lsst-scipipe-12.1.0/share/eups/EupsBuildDir/Darwin/gauss2d_fit-g199a45376c+f63862d77a/gauss2d_fit-g199a45376c+f63862d77a/build-release/meson-private/tmpe15279xl
Code:

        #include<stddef.h>
        #include<stdio.h>
        int main(void) {
            printf("%ld\n", (long)(sizeof(void *)));
            return 0;
        }
-----------
Command line: `arm64-apple-darwin20.0.0-clang++ -L/Users/jenkins/j/workspace/release/tarball/eb40a89f6a/build/conda/envs/lsst-scipipe-12.1.0/lib /Users/jenkins/j/workspace/release/tarball/eb40a89f6a/build/conda/envs/lsst-scipipe-12.1.0/share/eups/EupsBuildDir/Darwin/gauss2d_fit-g199a45376c+f63862d77a/gauss2d_fit-g199a45376c+f63862d77a/build-release/meson-private/tmpe15279xl/testfile.cpp -o /Users/jenkins/j/workspace/release/tarball/eb40a89f6a/build/conda/envs/lsst-scipipe-12.1.0/share/eups/EupsBuildDir/Darwin/gauss2d_fit-g199a45376c+f63862d77a/gauss2d_fit-g199a45376c+f63862d77a/build-release/meson-private/tmpe15279xl/output.exe -ftree-vectorize -fPIC -fstack-protector-strong -O2 -pipe -stdlib=libc++ -fvisibility-inlines-hidden -fmessage-length=0 -isystem /Users/jenkins/j/workspace/release/tarball/eb40a89f6a/build/conda/envs/lsst-scipipe-12.1.0/include -D_FORTIFY_SOURCE=2 -isystem /Users/jenkins/j/workspace/release/tarball/eb40a89f6a/build/conda/envs/lsst-scipipe-12.1.0/include -mmacosx-version-min=14-arm -mmacosx-version-min=11.0 -O0 -fpermissive -Werror=implicit-function-declaration -Wl,-headerpad_max_install_names -Wl,-dead_strip_dylibs -Wl,-rpath,/Users/jenkins/j/workspace/release/tarball/eb40a89f6a/build/conda/envs/lsst-scipipe-12.1.0/lib` -> 0
Program stdout:

8

Program stderr:


Running compile:
Working directory:  /Users/jenkins/j/workspace/release/tarball/eb40a89f6a/build/conda/envs/lsst-scipipe-12.1.0/share/eups/EupsBuildDir/Darwin/gauss2d_fit-g199a45376c+f63862d77a/gauss2d_fit-g199a45376c+f63862d77a/build-release/meson-private/tmpxwq_qyqm
Code:

-----------
Command line: `arm64-apple-darwin20.0.0-clang++ /Users/jenkins/j/workspace/release/tarball/eb40a89f6a/build/conda/envs/lsst-scipipe-12.1.0/share/eups/EupsBuildDir/Darwin/gauss2d_fit-g199a45376c+f63862d77a/gauss2d_fit-g199a45376c+f63862d77a/build-release/meson-private/tmpxwq_qyqm/testfile.cpp -o /Users/jenkins/j/workspace/release/tarball/eb40a89f6a/build/conda/envs/lsst-scipipe-12.1.0/share/eups/EupsBuildDir/Darwin/gauss2d_fit-g199a45376c+f63862d77a/gauss2d_fit-g199a45376c+f63862d77a/build-release/meson-private/tmpxwq_qyqm/output.obj -c -ftree-vectorize -fPIC -fstack-protector-strong -O2 -pipe -stdlib=libc++ -fvisibility-inlines-hidden -fmessage-length=0 -isystem /Users/jenkins/j/workspace/release/tarball/eb40a89f6a/build/conda/envs/lsst-scipipe-12.1.0/include -D_FORTIFY_SOURCE=2 -isystem /Users/jenkins/j/workspace/release/tarball/eb40a89f6a/build/conda/envs/lsst-scipipe-12.1.0/include -mmacosx-version-min=14-arm -mmacosx-version-min=11.0 -O0 -fpermissive -Werror=implicit-function-declaration -Werror=unknown-warning-option -Werror=unused-command-line-argument -Werror=ignored-optimization-argument --print-search-dirs` -> 0
stdout:
programs: =/Users/jenkins/j/workspace/release/tarball/eb40a89f6a/build/conda/envs/lsst-scipipe-12.1.0/bin
libraries: =/Users/jenkins/j/workspace/release/tarball/eb40a89f6a/build/conda/envs/lsst-scipipe-12.1.0/lib/clang/19
-----------
Running compile:
Working directory:  /Users/jenkins/j/workspace/release/tarball/eb40a89f6a/build/conda/envs/lsst-scipipe-12.1.0/share/eups/EupsBuildDir/Darwin/gauss2d_fit-g199a45376c+f63862d77a/gauss2d_fit-g199a45376c+f63862d77a/build-release/meson-private/tmp5684h_46
Code:
int main(void) { return 0; }

-----------
Command line: `arm64-apple-darwin20.0.0-clang++ -L/Users/jenkins/j/workspace/release/tarball/eb40a89f6a/build/conda/envs/lsst-scipipe-12.1.0/lib /Users/jenkins/j/workspace/release/tarball/eb40a89f6a/build/conda/envs/lsst-scipipe-12.1.0/share/eups/EupsBuildDir/Darwin/gauss2d_fit-g199a45376c+f63862d77a/gauss2d_fit-g199a45376c+f63862d77a/build-release/meson-private/tmp5684h_46/testfile.cpp -o /Users/jenkins/j/workspace/release/tarball/eb40a89f6a/build/conda/envs/lsst-scipipe-12.1.0/share/eups/EupsBuildDir/Darwin/gauss2d_fit-g199a45376c+f63862d77a/gauss2d_fit-g199a45376c+f63862d77a/build-release/meson-private/tmp5684h_46/output.exe -ftree-vectorize -fPIC -fstack-protector-strong -O2 -pipe -stdlib=libc++ -fvisibility-inlines-hidden -fmessage-length=0 -isystem /Users/jenkins/j/workspace/release/tarball/eb40a89f6a/build/conda/envs/lsst-scipipe-12.1.0/include -D_FORTIFY_SOURCE=2 -isystem /Users/jenkins/j/workspace/release/tarball/eb40a89f6a/build/conda/envs/lsst-scipipe-12.1.0/include -mmacosx-version-min=14-arm -mmacosx-version-min=11.0 -O0 -fpermissive -Werror=implicit-function-declaration /Users/jenkins/j/workspace/release/tarball/eb40a89f6a/build/conda/envs/lsst-scipipe-12.1.0/lib/libgsl.dylib -Wl,-undefined,dynamic_lookup -Wl,-headerpad_max_install_names -Wl,-dead_strip_dylibs -Wl,-rpath,/Users/jenkins/j/workspace/release/tarball/eb40a89f6a/build/conda/envs/lsst-scipipe-12.1.0/lib` -> 0
Running compile:
Working directory:  /Users/jenkins/j/workspace/release/tarball/eb40a89f6a/build/conda/envs/lsst-scipipe-12.1.0/share/eups/EupsBuildDir/Darwin/gauss2d_fit-g199a45376c+f63862d77a/gauss2d_fit-g199a45376c+f63862d77a/build-release/meson-private/tmpvsjzhvwg
Code:
int main(void) { return 0; }

-----------
Command line: `arm64-apple-darwin20.0.0-clang++ -L/Users/jenkins/j/workspace/release/tarball/eb40a89f6a/build/conda/envs/lsst-scipipe-12.1.0/lib /Users/jenkins/j/workspace/release/tarball/eb40a89f6a/build/conda/envs/lsst-scipipe-12.1.0/share/eups/EupsBuildDir/Darwin/gauss2d_fit-g199a45376c+f63862d77a/gauss2d_fit-g199a45376c+f63862d77a/build-release/meson-private/tmpvsjzhvwg/testfile.cpp -o /Users/jenkins/j/workspace/release/tarball/eb40a89f6a/build/conda/envs/lsst-scipipe-12.1.0/share/eups/EupsBuildDir/Darwin/gauss2d_fit-g199a45376c+f63862d77a/gauss2d_fit-g199a45376c+f63862d77a/build-release/meson-private/tmpvsjzhvwg/output.exe -ftree-vectorize -fPIC -fstack-protector-strong -O2 -pipe -stdlib=libc++ -fvisibility-inlines-hidden -fmessage-length=0 -isystem /Users/jenkins/j/workspace/release/tarball/eb40a89f6a/build/conda/envs/lsst-scipipe-12.1.0/include -D_FORTIFY_SOURCE=2 -isystem /Users/jenkins/j/workspace/release/tarball/eb40a89f6a/build/conda/envs/lsst-scipipe-12.1.0/include -mmacosx-version-min=14-arm -mmacosx-version-min=11.0 -O0 -fpermissive -Werror=implicit-function-declaration /Users/jenkins/j/workspace/release/tarball/eb40a89f6a/build/conda/envs/lsst-scipipe-12.1.0/lib/libgslcblas.dylib -Wl,-undefined,dynamic_lookup -Wl,-headerpad_max_install_names -Wl,-dead_strip_dylibs -Wl,-rpath,/Users/jenkins/j/workspace/release/tarball/eb40a89f6a/build/conda/envs/lsst-scipipe-12.1.0/lib` -> 0
Running compile:
Working directory:  /Users/jenkins/j/workspace/release/tarball/eb40a89f6a/build/conda/envs/lsst-scipipe-12.1.0/share/eups/EupsBuildDir/Darwin/gauss2d_fit-g199a45376c+f63862d77a/gauss2d_fit-g199a45376c+f63862d77a/build-release/meson-private/tmp1tdkoyte
Code:
int main(void) { return 0; }

-----------
Command line: `arm64-apple-darwin20.0.0-clang++ -L/Users/jenkins/j/workspace/release/tarball/eb40a89f6a/build/conda/envs/lsst-scipipe-12.1.0/lib /Users/jenkins/j/workspace/release/tarball/eb40a89f6a/build/conda/envs/lsst-scipipe-12.1.0/share/eups/EupsBuildDir/Darwin/gauss2d_fit-g199a45376c+f63862d77a/gauss2d_fit-g199a45376c+f63862d77a/build-release/meson-private/tmp1tdkoyte/testfile.cpp -o /Users/jenkins/j/workspace/release/tarball/eb40a89f6a/build/conda/envs/lsst-scipipe-12.1.0/share/eups/EupsBuildDir/Darwin/gauss2d_fit-g199a45376c+f63862d77a/gauss2d_fit-g199a45376c+f63862d77a/build-release/meson-private/tmp1tdkoyte/output.exe -ftree-vectorize -fPIC -fstack-protector-strong -O2 -pipe -stdlib=libc++ -fvisibility-inlines-hidden -fmessage-length=0 -isystem /Users/jenkins/j/workspace/release/tarball/eb40a89f6a/build/conda/envs/lsst-scipipe-12.1.0/include -D_FORTIFY_SOURCE=2 -isystem /Users/jenkins/j/workspace/release/tarball/eb40a89f6a/build/conda/envs/lsst-scipipe-12.1.0/include -mmacosx-version-min=14-arm -mmacosx-version-min=11.0 -O0 -fpermissive -Werror=implicit-function-declaration /Users/jenkins/j/workspace/release/tarball/eb40a89f6a/build/conda/envs/lsst-scipipe-12.1.0/lib/libcblas.dylib -Wl,-undefined,dynamic_lookup -Wl,-headerpad_max_install_names -Wl,-dead_strip_dylibs -Wl,-rpath,/Users/jenkins/j/workspace/release/tarball/eb40a89f6a/build/conda/envs/lsst-scipipe-12.1.0/lib` -> 0
Running compile:
Working directory:  /Users/jenkins/j/workspace/release/tarball/eb40a89f6a/build/conda/envs/lsst-scipipe-12.1.0/share/eups/EupsBuildDir/Darwin/gauss2d_fit-g199a45376c+f63862d77a/gauss2d_fit-g199a45376c+f63862d77a/build-release/meson-private/tmp2cpdqtzy
Code:
int main(void) { return 0; }

-----------
Command line: `arm64-apple-darwin20.0.0-clang++ -L/Users/jenkins/j/workspace/release/tarball/eb40a89f6a/build/conda/envs/lsst-scipipe-12.1.0/lib /Users/jenkins/j/workspace/release/tarball/eb40a89f6a/build/conda/envs/lsst-scipipe-12.1.0/share/eups/EupsBuildDir/Darwin/gauss2d_fit-g199a45376c+f63862d77a/gauss2d_fit-g199a45376c+f63862d77a/build-release/meson-private/tmp2cpdqtzy/testfile.cpp -o /Users/jenkins/j/workspace/release/tarball/eb40a89f6a/build/conda/envs/lsst-scipipe-12.1.0/share/eups/EupsBuildDir/Darwin/gauss2d_fit-g199a45376c+f63862d77a/gauss2d_fit-g199a45376c+f63862d77a/build-release/meson-private/tmp2cpdqtzy/output.exe -ftree-vectorize -fPIC -fstack-protector-strong -O2 -pipe -stdlib=libc++ -fvisibility-inlines-hidden -fmessage-length=0 -isystem /Users/jenkins/j/workspace/release/tarball/eb40a89f6a/build/conda/envs/lsst-scipipe-12.1.0/include -D_FORTIFY_SOURCE=2 -isystem /Users/jenkins/j/workspace/release/tarball/eb40a89f6a/build/conda/envs/lsst-scipipe-12.1.0/include -mmacosx-version-min=14-arm -mmacosx-version-min=11.0 -O0 -fpermissive -Werror=implicit-function-declaration -lm -Wl,-undefined,dynamic_lookup -Wl,-headerpad_max_install_names -Wl,-dead_strip_dylibs -Wl,-rpath,/Users/jenkins/j/workspace/release/tarball/eb40a89f6a/build/conda/envs/lsst-scipipe-12.1.0/lib` -> 0
Run-time dependency gsl found: YES 2.7
Running command: /bin/sh -c 'echo $GAUSS2D_DIR'
--- stdout ---
/Users/jenkins/j/workspace/release/tarball/eb40a89f6a/build/conda/envs/lsst-scipipe-12.1.0/share/eups/Darwin/gauss2d/gbf99507273+9de55b6e8b

--- stderr ---


Running compile:
Working directory:  /Users/jenkins/j/workspace/release/tarball/eb40a89f6a/build/conda/envs/lsst-scipipe-12.1.0/share/eups/EupsBuildDir/Darwin/gauss2d_fit-g199a45376c+f63862d77a/gauss2d_fit-g199a45376c+f63862d77a/build-release/meson-private/tmp20slukwc
Code:
int main(void) { return 0; }

-----------
Command line: `arm64-apple-darwin20.0.0-clang++ -L/Users/jenkins/j/workspace/release/tarball/eb40a89f6a/build/conda/envs/lsst-scipipe-12.1.0/lib /Users/jenkins/j/workspace/release/tarball/eb40a89f6a/build/conda/envs/lsst-scipipe-12.1.0/share/eups/EupsBuildDir/Darwin/gauss2d_fit-g199a45376c+f63862d77a/gauss2d_fit-g199a45376c+f63862d77a/build-release/meson-private/tmp20slukwc/testfile.cpp -o /Users/jenkins/j/workspace/release/tarball/eb40a89f6a/build/conda/envs/lsst-scipipe-12.1.0/share/eups/EupsBuildDir/Darwin/gauss2d_fit-g199a45376c+f63862d77a/gauss2d_fit-g199a45376c+f63862d77a/build-release/meson-private/tmp20slukwc/output.exe -ftree-vectorize -fPIC -fstack-protector-strong -O2 -pipe -stdlib=libc++ -fvisibility-inlines-hidden -fmessage-length=0 -isystem /Users/jenkins/j/workspace/release/tarball/eb40a89f6a/build/conda/envs/lsst-scipipe-12.1.0/include -D_FORTIFY_SOURCE=2 -isystem /Users/jenkins/j/workspace/release/tarball/eb40a89f6a/build/conda/envs/lsst-scipipe-12.1.0/include -mmacosx-version-min=14-arm -mmacosx-version-min=11.0 -O0 -fpermissive -Werror=implicit-function-declaration /Users/jenkins/j/workspace/release/tarball/eb40a89f6a/build/conda/envs/lsst-scipipe-12.1.0/share/eups/Darwin/gauss2d/gbf99507273+9de55b6e8b/build-release/lib/lsst/libgauss2d.dylib -Wl,-undefined,dynamic_lookup -Wl,-headerpad_max_install_names -Wl,-dead_strip_dylibs -Wl,-rpath,/Users/jenkins/j/workspace/release/tarball/eb40a89f6a/build/conda/envs/lsst-scipipe-12.1.0/lib` -> 0
Library gauss2d found: YES
Running command: /bin/sh -c 'echo $MODELFIT_PARAMETERS_DIR'
--- stdout ---
/Users/jenkins/j/workspace/release/tarball/eb40a89f6a/build/conda/envs/lsst-scipipe-12.1.0/share/eups/Darwin/modelfit_parameters/g35bb328faa+9de55b6e8b

--- stderr ---


Adding test "centroidparameters"
Adding test "channel"
Adding test "data"
Adding test "fractionalintegralmodel"
Adding test "gaussiancomponent"
Adding test "gaussianparametricellipse"
Adding test "gaussianprior"
Adding test "gslinterpolator"
Adding test "gslsersicmixinterpolator"
Adding test "linearintegralmodel"
Adding test "linearsersicmixinterpolator"
Adding test "model"
Adding test "observation"
Adding test "parametricgaussian1d"
Adding test "psfmodel"
Adding test "sersicmix"
Adding test "sersicmixcomponent"
Adding test "shapeprior"
Adding test "source"
Build targets in project: 20

libgauss2d_fit 0.3.0

  User defined options
    buildtype: release
    libdir   : lib
    prefix   : /Users/jenkins/j/workspace/release/tarball/eb40a89f6a/build/conda/envs/lsst-scipipe-12.1.0/share/eups/EupsBuildDir/Darwin/gauss2d_fit-g199a45376c+f63862d77a/gauss2d_fit-g199a45376c+f63862d77a/build-release

Found ninja-1.13.2 at /Users/jenkins/j/workspace/release/tarball/eb40a89f6a/build/conda/envs/lsst-scipipe-12.1.0/bin/ninja
Running compile:
Working directory:  /Users/jenkins/j/workspace/release/tarball/eb40a89f6a/build/conda/envs/lsst-scipipe-12.1.0/share/eups/EupsBuildDir/Darwin/gauss2d_fit-g199a45376c+f63862d77a/gauss2d_fit-g199a45376c+f63862d77a/build-release/meson-private/tmp97m52l4l
Code:

        #ifdef __has_include
         #if !__has_include("version")
          #error "Header 'version' could not be found"
         #endif
        #else
         #include <version>
        #endif
-----------
Command line: `arm64-apple-darwin20.0.0-clang++ /Users/jenkins/j/workspace/release/tarball/eb40a89f6a/build/conda/envs/lsst-scipipe-12.1.0/share/eups/EupsBuildDir/Darwin/gauss2d_fit-g199a45376c+f63862d77a/gauss2d_fit-g199a45376c+f63862d77a/build-release/meson-private/tmp97m52l4l/testfile.cpp -E -P -ftree-vectorize -fPIC -fstack-protector-strong -O2 -pipe -stdlib=libc++ -fvisibility-inlines-hidden -fmessage-length=0 -isystem /Users/jenkins/j/workspace/release/tarball/eb40a89f6a/build/conda/envs/lsst-scipipe-12.1.0/include -D_FORTIFY_SOURCE=2 -isystem /Users/jenkins/j/workspace/release/tarball/eb40a89f6a/build/conda/envs/lsst-scipipe-12.1.0/include -mmacosx-version-min=14-arm -mmacosx-version-min=11.0 -P -O0 -fpermissive -Werror=implicit-function-declaration` -> 0
Running compile:
Working directory:  /Users/jenkins/j/workspace/release/tarball/eb40a89f6a/build/conda/envs/lsst-scipipe-12.1.0/share/eups/EupsBuildDir/Darwin/gauss2d_fit-g199a45376c+f63862d77a/gauss2d_fit-g199a45376c+f63862d77a/build-release/meson-private/tmpe42uxog4
Code:

        #include <version>
        int main(void) {
            /* If it's not defined as a macro, try to use as a symbol */
            #ifndef _LIBCPP_VERSION
                _LIBCPP_VERSION;
            #endif
            return 0;
        }
-----------
Command line: `arm64-apple-darwin20.0.0-clang++ /Users/jenkins/j/workspace/release/tarball/eb40a89f6a/build/conda/envs/lsst-scipipe-12.1.0/share/eups/EupsBuildDir/Darwin/gauss2d_fit-g199a45376c+f63862d77a/gauss2d_fit-g199a45376c+f63862d77a/build-release/meson-private/tmpe42uxog4/testfile.cpp -o /Users/jenkins/j/workspace/release/tarball/eb40a89f6a/build/conda/envs/lsst-scipipe-12.1.0/share/eups/EupsBuildDir/Darwin/gauss2d_fit-g199a45376c+f63862d77a/gauss2d_fit-g199a45376c+f63862d77a/build-release/meson-private/tmpe42uxog4/output.obj -c -ftree-vectorize -fPIC -fstack-protector-strong -O2 -pipe -stdlib=libc++ -fvisibility-inlines-hidden -fmessage-length=0 -isystem /Users/jenkins/j/workspace/release/tarball/eb40a89f6a/build/conda/envs/lsst-scipipe-12.1.0/include -D_FORTIFY_SOURCE=2 -isystem /Users/jenkins/j/workspace/release/tarball/eb40a89f6a/build/conda/envs/lsst-scipipe-12.1.0/include -mmacosx-version-min=14-arm -mmacosx-version-min=11.0 -O0 -fpermissive -Werror=implicit-function-declaration -Werror=unknown-warning-option -Werror=unused-command-line-argument -Werror=ignored-optimization-argument` -> 0
Running compile:
Working directory:  /var/folders/9x/708ytvk10xdg3t5rj3q17jdr0000gp/T/tmpzs4mfb8_
Code:
int i = static_cast<int>(0);
-----------
Command line: `arm64-apple-darwin20.0.0-clang++ /var/folders/9x/708ytvk10xdg3t5rj3q17jdr0000gp/T/tmpzs4mfb8_/testfile.cpp -o /var/folders/9x/708ytvk10xdg3t5rj3q17jdr0000gp/T/tmpzs4mfb8_/output.obj -c -std=c++20` -> 0
Compiler accepts -std=c++20: YES
Using cached compile:
Cached command line:  arm64-apple-darwin20.0.0-clang++ /Users/jenkins/j/workspace/release/tarball/eb40a89f6a/build/conda/envs/lsst-scipipe-12.1.0/share/eups/EupsBuildDir/Darwin/gauss2d_fit-g199a45376c+f63862d77a/gauss2d_fit-g199a45376c+f63862d77a/build-release/meson-private/tmp97m52l4l/testfile.cpp -E -P -ftree-vectorize -fPIC -fstack-protector-strong -O2 -pipe -stdlib=libc++ -fvisibility-inlines-hidden -fmessage-length=0 -isystem /Users/jenkins/j/workspace/release/tarball/eb40a89f6a/build/conda/envs/lsst-scipipe-12.1.0/include -D_FORTIFY_SOURCE=2 -isystem /Users/jenkins/j/workspace/release/tarball/eb40a89f6a/build/conda/envs/lsst-scipipe-12.1.0/include -mmacosx-version-min=14-arm -mmacosx-version-min=11.0 -P -O0 -fpermissive -Werror=implicit-function-declaration 

Code:
 
        #ifdef __has_include
         #if !__has_include("version")
          #error "Header 'version' could not be found"
         #endif
        #else
         #include <version>
        #endif
Cached compiler stdout:
 

Cached compiler stderr:
 
Using cached compile:
Cached command line:  arm64-apple-darwin20.0.0-clang++ /Users/jenkins/j/workspace/release/tarball/eb40a89f6a/build/conda/envs/lsst-scipipe-12.1.0/share/eups/EupsBuildDir/Darwin/gauss2d_fit-g199a45376c+f63862d77a/gauss2d_fit-g199a45376c+f63862d77a/build-release/meson-private/tmpe42uxog4/testfile.cpp -o /Users/jenkins/j/workspace/release/tarball/eb40a89f6a/build/conda/envs/lsst-scipipe-12.1.0/share/eups/EupsBuildDir/Darwin/gauss2d_fit-g199a45376c+f63862d77a/gauss2d_fit-g199a45376c+f63862d77a/build-release/meson-private/tmpe42uxog4/output.obj -c -ftree-vectorize -fPIC -fstack-protector-strong -O2 -pipe -stdlib=libc++ -fvisibility-inlines-hidden -fmessage-length=0 -isystem /Users/jenkins/j/workspace/release/tarball/eb40a89f6a/build/conda/envs/lsst-scipipe-12.1.0/include -D_FORTIFY_SOURCE=2 -isystem /Users/jenkins/j/workspace/release/tarball/eb40a89f6a/build/conda/envs/lsst-scipipe-12.1.0/include -mmacosx-version-min=14-arm -mmacosx-version-min=11.0 -O0 -fpermissive -Werror=implicit-function-declaration -Werror=unknown-warning-option -Werror=unused-command-line-argument -Werror=ignored-optimization-argument 

Code:
 
        #include <version>
        int main(void) {
            /* If it's not defined as a macro, try to use as a symbol */
            #ifndef _LIBCPP_VERSION
                _LIBCPP_VERSION;
            #endif
            return 0;
        }
Cached compiler stdout:
 
Cached compiler stderr:
 
Using cached compile:
Cached command line:  arm64-apple-darwin20.0.0-clang++ /Users/jenkins/j/workspace/release/tarball/eb40a89f6a/build/conda/envs/lsst-scipipe-12.1.0/share/eups/EupsBuildDir/Darwin/gauss2d_fit-g199a45376c+f63862d77a/gauss2d_fit-g199a45376c+f63862d77a/build-release/meson-private/tmp97m52l4l/testfile.cpp -E -P -ftree-vectorize -fPIC -fstack-protector-strong -O2 -pipe -stdlib=libc++ -fvisibility-inlines-hidden -fmessage-length=0 -isystem /Users/jenkins/j/workspace/release/tarball/eb40a89f6a/build/conda/envs/lsst-scipipe-12.1.0/include -D_FORTIFY_SOURCE=2 -isystem /Users/jenkins/j/workspace/release/tarball/eb40a89f6a/build/conda/envs/lsst-scipipe-12.1.0/include -mmacosx-version-min=14-arm -mmacosx-version-min=11.0 -P -O0 -fpermissive -Werror=implicit-function-declaration 

Code:
 
        #ifdef __has_include
         #if !__has_include("version")
          #error "Header 'version' could not be found"
         #endif
        #else
         #include <version>
        #endif
Cached compiler stdout:
 

Cached compiler stderr:
 
Using cached compile:
Cached command line:  arm64-apple-darwin20.0.0-clang++ /Users/jenkins/j/workspace/release/tarball/eb40a89f6a/build/conda/envs/lsst-scipipe-12.1.0/share/eups/EupsBuildDir/Darwin/gauss2d_fit-g199a45376c+f63862d77a/gauss2d_fit-g199a45376c+f63862d77a/build-release/meson-private/tmpe42uxog4/testfile.cpp -o /Users/jenkins/j/workspace/release/tarball/eb40a89f6a/build/conda/envs/lsst-scipipe-12.1.0/share/eups/EupsBuildDir/Darwin/gauss2d_fit-g199a45376c+f63862d77a/gauss2d_fit-g199a45376c+f63862d77a/build-release/meson-private/tmpe42uxog4/output.obj -c -ftree-vectorize -fPIC -fstack-protector-strong -O2 -pipe -stdlib=libc++ -fvisibility-inlines-hidden -fmessage-length=0 -isystem /Users/jenkins/j/workspace/release/tarball/eb40a89f6a/build/conda/envs/lsst-scipipe-12.1.0/include -D_FORTIFY_SOURCE=2 -isystem /Users/jenkins/j/workspace/release/tarball/eb40a89f6a/build/conda/envs/lsst-scipipe-12.1.0/include -mmacosx-version-min=14-arm -mmacosx-version-min=11.0 -O0 -fpermissive -Werror=implicit-function-declaration -Werror=unknown-warning-option -Werror=unused-command-line-argument -Werror=ignored-optimization-argument 

Code:
 
        #include <version>
        int main(void) {
            /* If it's not defined as a macro, try to use as a symbol */
            #ifndef _LIBCPP_VERSION
                _LIBCPP_VERSION;
            #endif
            return 0;
        }
Cached compiler stdout:
 
Cached compiler stderr:
 
Using cached compile:
Cached command line:  arm64-apple-darwin20.0.0-clang++ /Users/jenkins/j/workspace/release/tarball/eb40a89f6a/build/conda/envs/lsst-scipipe-12.1.0/share/eups/EupsBuildDir/Darwin/gauss2d_fit-g199a45376c+f63862d77a/gauss2d_fit-g199a45376c+f63862d77a/build-release/meson-private/tmp97m52l4l/testfile.cpp -E -P -ftree-vectorize -fPIC -fstack-protector-strong -O2 -pipe -stdlib=libc++ -fvisibility-inlines-hidden -fmessage-length=0 -isystem /Users/jenkins/j/workspace/release/tarball/eb40a89f6a/build/conda/envs/lsst-scipipe-12.1.0/include -D_FORTIFY_SOURCE=2 -isystem /Users/jenkins/j/workspace/release/tarball/eb40a89f6a/build/conda/envs/lsst-scipipe-12.1.0/include -mmacosx-version-min=14-arm -mmacosx-version-min=11.0 -P -O0 -fpermissive -Werror=implicit-function-declaration 

Code:
 
        #ifdef __has_include
         #if !__has_include("version")
          #error "Header 'version' could not be found"
         #endif
        #else
         #include <version>
        #endif
Cached compiler stdout:
 

Cached compiler stderr:
 
Using cached compile:
Cached command line:  arm64-apple-darwin20.0.0-clang++ /Users/jenkins/j/workspace/release/tarball/eb40a89f6a/build/conda/envs/lsst-scipipe-12.1.0/share/eups/EupsBuildDir/Darwin/gauss2d_fit-g199a45376c+f63862d77a/gauss2d_fit-g199a45376c+f63862d77a/build-release/meson-private/tmpe42uxog4/testfile.cpp -o /Users/jenkins/j/workspace/release/tarball/eb40a89f6a/build/conda/envs/lsst-scipipe-12.1.0/share/eups/EupsBuildDir/Darwin/gauss2d_fit-g199a45376c+f63862d77a/gauss2d_fit-g199a45376c+f63862d77a/build-release/meson-private/tmpe42uxog4/output.obj -c -ftree-vectorize -fPIC -fstack-protector-strong -O2 -pipe -stdlib=libc++ -fvisibility-inlines-hidden -fmessage-length=0 -isystem /Users/jenkins/j/workspace/release/tarball/eb40a89f6a/build/conda/envs/lsst-scipipe-12.1.0/include -D_FORTIFY_SOURCE=2 -isystem /Users/jenkins/j/workspace/release/tarball/eb40a89f6a/build/conda/envs/lsst-scipipe-12.1.0/include -mmacosx-version-min=14-arm -mmacosx-version-min=11.0 -O0 -fpermissive -Werror=implicit-function-declaration -Werror=unknown-warning-option -Werror=unused-command-line-argument -Werror=ignored-optimization-argument 

Code:
 
        #include <version>
        int main(void) {
            /* If it's not defined as a macro, try to use as a symbol */
            #ifndef _LIBCPP_VERSION
                _LIBCPP_VERSION;
            #endif
            return 0;
        }
Cached compiler stdout:
 
Cached compiler stderr:
 
Using cached compile:
Cached command line:  arm64-apple-darwin20.0.0-clang++ /Users/jenkins/j/workspace/release/tarball/eb40a89f6a/build/conda/envs/lsst-scipipe-12.1.0/share/eups/EupsBuildDir/Darwin/gauss2d_fit-g199a45376c+f63862d77a/gauss2d_fit-g199a45376c+f63862d77a/build-release/meson-private/tmp97m52l4l/testfile.cpp -E -P -ftree-vectorize -fPIC -fstack-protector-strong -O2 -pipe -stdlib=libc++ -fvisibility-inlines-hidden -fmessage-length=0 -isystem /Users/jenkins/j/workspace/release/tarball/eb40a89f6a/build/conda/envs/lsst-scipipe-12.1.0/include -D_FORTIFY_SOURCE=2 -isystem /Users/jenkins/j/workspace/release/tarball/eb40a89f6a/build/conda/envs/lsst-scipipe-12.1.0/include -mmacosx-version-min=14-arm -mmacosx-version-min=11.0 -P -O0 -fpermissive -Werror=implicit-function-declaration 

Code:
 
        #ifdef __has_include
         #if !__has_include("version")
          #error "Header 'version' could not be found"
         #endif
        #else
         #include <version>
        #endif
Cached compiler stdout:
 

Cached compiler stderr:
 
Using cached compile:
Cached command line:  arm64-apple-darwin20.0.0-clang++ /Users/jenkins/j/workspace/release/tarball/eb40a89f6a/build/conda/envs/lsst-scipipe-12.1.0/share/eups/EupsBuildDir/Darwin/gauss2d_fit-g199a45376c+f63862d77a/gauss2d_fit-g199a45376c+f63862d77a/build-release/meson-private/tmpe42uxog4/testfile.cpp -o /Users/jenkins/j/workspace/release/tarball/eb40a89f6a/build/conda/envs/lsst-scipipe-12.1.0/share/eups/EupsBuildDir/Darwin/gauss2d_fit-g199a45376c+f63862d77a/gauss2d_fit-g199a45376c+f63862d77a/build-release/meson-private/tmpe42uxog4/output.obj -c -ftree-vectorize -fPIC -fstack-protector-strong -O2 -pipe -stdlib=libc++ -fvisibility-inlines-hidden -fmessage-length=0 -isystem /Users/jenkins/j/workspace/release/tarball/eb40a89f6a/build/conda/envs/lsst-scipipe-12.1.0/include -D_FORTIFY_SOURCE=2 -isystem /Users/jenkins/j/workspace/release/tarball/eb40a89f6a/build/conda/envs/lsst-scipipe-12.1.0/include -mmacosx-version-min=14-arm -mmacosx-version-min=11.0 -O0 -fpermissive -Werror=implicit-function-declaration -Werror=unknown-warning-option -Werror=unused-command-line-argument -Werror=ignored-optimization-argument 

Code:
 
        #include <version>
        int main(void) {
            /* If it's not defined as a macro, try to use as a symbol */
            #ifndef _LIBCPP_VERSION
                _LIBCPP_VERSION;
            #endif
            return 0;
        }
Cached compiler stdout:
 
Cached compiler stderr:
 
Using cached compile:
Cached command line:  arm64-apple-darwin20.0.0-clang++ /Users/jenkins/j/workspace/release/tarball/eb40a89f6a/build/conda/envs/lsst-scipipe-12.1.0/share/eups/EupsBuildDir/Darwin/gauss2d_fit-g199a45376c+f63862d77a/gauss2d_fit-g199a45376c+f63862d77a/build-release/meson-private/tmp97m52l4l/testfile.cpp -E -P -ftree-vectorize -fPIC -fstack-protector-strong -O2 -pipe -stdlib=libc++ -fvisibility-inlines-hidden -fmessage-length=0 -isystem /Users/jenkins/j/workspace/release/tarball/eb40a89f6a/build/conda/envs/lsst-scipipe-12.1.0/include -D_FORTIFY_SOURCE=2 -isystem /Users/jenkins/j/workspace/release/tarball/eb40a89f6a/build/conda/envs/lsst-scipipe-12.1.0/include -mmacosx-version-min=14-arm -mmacosx-version-min=11.0 -P -O0 -fpermissive -Werror=implicit-function-declaration 

Code:
 
        #ifdef __has_include
         #if !__has_include("version")
          #error "Header 'version' could not be found"
         #endif
        #else
         #include <version>
        #endif
Cached compiler stdout:
 

Cached compiler stderr:
 
Using cached compile:
Cached command line:  arm64-apple-darwin20.0.0-clang++ /Users/jenkins/j/workspace/release/tarball/eb40a89f6a/build/conda/envs/lsst-scipipe-12.1.0/share/eups/EupsBuildDir/Darwin/gauss2d_fit-g199a45376c+f63862d77a/gauss2d_fit-g199a45376c+f63862d77a/build-release/meson-private/tmpe42uxog4/testfile.cpp -o /Users/jenkins/j/workspace/release/tarball/eb40a89f6a/build/conda/envs/lsst-scipipe-12.1.0/share/eups/EupsBuildDir/Darwin/gauss2d_fit-g199a45376c+f63862d77a/gauss2d_fit-g199a45376c+f63862d77a/build-release/meson-private/tmpe42uxog4/output.obj -c -ftree-vectorize -fPIC -fstack-protector-strong -O2 -pipe -stdlib=libc++ -fvisibility-inlines-hidden -fmessage-length=0 -isystem /Users/jenkins/j/workspace/release/tarball/eb40a89f6a/build/conda/envs/lsst-scipipe-12.1.0/include -D_FORTIFY_SOURCE=2 -isystem /Users/jenkins/j/workspace/release/tarball/eb40a89f6a/build/conda/envs/lsst-scipipe-12.1.0/include -mmacosx-version-min=14-arm -mmacosx-version-min=11.0 -O0 -fpermissive -Werror=implicit-function-declaration -Werror=unknown-warning-option -Werror=unused-command-line-argument -Werror=ignored-optimization-argument 

Code:
 
        #include <version>
        int main(void) {
            /* If it's not defined as a macro, try to use as a symbol */
            #ifndef _LIBCPP_VERSION
                _LIBCPP_VERSION;
            #endif
            return 0;
        }
Cached compiler stdout:
 
Cached compiler stderr:
 
Using cached compile:
Cached command line:  arm64-apple-darwin20.0.0-clang++ /Users/jenkins/j/workspace/release/tarball/eb40a89f6a/build/conda/envs/lsst-scipipe-12.1.0/share/eups/EupsBuildDir/Darwin/gauss2d_fit-g199a45376c+f63862d77a/gauss2d_fit-g199a45376c+f63862d77a/build-release/meson-private/tmp97m52l4l/testfile.cpp -E -P -ftree-vectorize -fPIC -fstack-protector-strong -O2 -pipe -stdlib=libc++ -fvisibility-inlines-hidden -fmessage-length=0 -isystem /Users/jenkins/j/workspace/release/tarball/eb40a89f6a/build/conda/envs/lsst-scipipe-12.1.0/include -D_FORTIFY_SOURCE=2 -isystem /Users/jenkins/j/workspace/release/tarball/eb40a89f6a/build/conda/envs/lsst-scipipe-12.1.0/include -mmacosx-version-min=14-arm -mmacosx-version-min=11.0 -P -O0 -fpermissive -Werror=implicit-function-declaration 

Code:
 
        #ifdef __has_include
         #if !__has_include("version")
          #error "Header 'version' could not be found"
         #endif
        #else
         #include <version>
        #endif
Cached compiler stdout:
 

Cached compiler stderr:
 
Using cached compile:
Cached command line:  arm64-apple-darwin20.0.0-clang++ /Users/jenkins/j/workspace/release/tarball/eb40a89f6a/build/conda/envs/lsst-scipipe-12.1.0/share/eups/EupsBuildDir/Darwin/gauss2d_fit-g199a45376c+f63862d77a/gauss2d_fit-g199a45376c+f63862d77a/build-release/meson-private/tmpe42uxog4/testfile.cpp -o /Users/jenkins/j/workspace/release/tarball/eb40a89f6a/build/conda/envs/lsst-scipipe-12.1.0/share/eups/EupsBuildDir/Darwin/gauss2d_fit-g199a45376c+f63862d77a/gauss2d_fit-g199a45376c+f63862d77a/build-release/meson-private/tmpe42uxog4/output.obj -c -ftree-vectorize -fPIC -fstack-protector-strong -O2 -pipe -stdlib=libc++ -fvisibility-inlines-hidden -fmessage-length=0 -isystem /Users/jenkins/j/workspace/release/tarball/eb40a89f6a/build/conda/envs/lsst-scipipe-12.1.0/include -D_FORTIFY_SOURCE=2 -isystem /Users/jenkins/j/workspace/release/tarball/eb40a89f6a/build/conda/envs/lsst-scipipe-12.1.0/include -mmacosx-version-min=14-arm -mmacosx-version-min=11.0 -O0 -fpermissive -Werror=implicit-function-declaration -Werror=unknown-warning-option -Werror=unused-command-line-argument -Werror=ignored-optimization-argument 

Code:
 
        #include <version>
        int main(void) {
            /* If it's not defined as a macro, try to use as a symbol */
            #ifndef _LIBCPP_VERSION
                _LIBCPP_VERSION;
            #endif
            return 0;
        }
Cached compiler stdout:
 
Cached compiler stderr:
 
Using cached compile:
Cached command line:  arm64-apple-darwin20.0.0-clang++ /Users/jenkins/j/workspace/release/tarball/eb40a89f6a/build/conda/envs/lsst-scipipe-12.1.0/share/eups/EupsBuildDir/Darwin/gauss2d_fit-g199a45376c+f63862d77a/gauss2d_fit-g199a45376c+f63862d77a/build-release/meson-private/tmp97m52l4l/testfile.cpp -E -P -ftree-vectorize -fPIC -fstack-protector-strong -O2 -pipe -stdlib=libc++ -fvisibility-inlines-hidden -fmessage-length=0 -isystem /Users/jenkins/j/workspace/release/tarball/eb40a89f6a/build/conda/envs/lsst-scipipe-12.1.0/include -D_FORTIFY_SOURCE=2 -isystem /Users/jenkins/j/workspace/release/tarball/eb40a89f6a/build/conda/envs/lsst-scipipe-12.1.0/include -mmacosx-version-min=14-arm -mmacosx-version-min=11.0 -P -O0 -fpermissive -Werror=implicit-function-declaration 

Code:
 
        #ifdef __has_include
         #if !__has_include("version")
          #error "Header 'version' could not be found"
         #endif
        #else
         #include <version>
        #endif
Cached compiler stdout:
 

Cached compiler stderr:
 
Using cached compile:
Cached command line:  arm64-apple-darwin20.0.0-clang++ /Users/jenkins/j/workspace/release/tarball/eb40a89f6a/build/conda/envs/lsst-scipipe-12.1.0/share/eups/EupsBuildDir/Darwin/gauss2d_fit-g199a45376c+f63862d77a/gauss2d_fit-g199a45376c+f63862d77a/build-release/meson-private/tmpe42uxog4/testfile.cpp -o /Users/jenkins/j/workspace/release/tarball/eb40a89f6a/build/conda/envs/lsst-scipipe-12.1.0/share/eups/EupsBuildDir/Darwin/gauss2d_fit-g199a45376c+f63862d77a/gauss2d_fit-g199a45376c+f63862d77a/build-release/meson-private/tmpe42uxog4/output.obj -c -ftree-vectorize -fPIC -fstack-protector-strong -O2 -pipe -stdlib=libc++ -fvisibility-inlines-hidden -fmessage-length=0 -isystem /Users/jenkins/j/workspace/release/tarball/eb40a89f6a/build/conda/envs/lsst-scipipe-12.1.0/include -D_FORTIFY_SOURCE=2 -isystem /Users/jenkins/j/workspace/release/tarball/eb40a89f6a/build/conda/envs/lsst-scipipe-12.1.0/include -mmacosx-version-min=14-arm -mmacosx-version-min=11.0 -O0 -fpermissive -Werror=implicit-function-declaration -Werror=unknown-warning-option -Werror=unused-command-line-argument -Werror=ignored-optimization-argument 

Code:
 
        #include <version>
        int main(void) {
            /* If it's not defined as a macro, try to use as a symbol */
            #ifndef _LIBCPP_VERSION
                _LIBCPP_VERSION;
            #endif
            return 0;
        }
Cached compiler stdout:
 
Cached compiler stderr:
 
Using cached compile:
Cached command line:  arm64-apple-darwin20.0.0-clang++ /Users/jenkins/j/workspace/release/tarball/eb40a89f6a/build/conda/envs/lsst-scipipe-12.1.0/share/eups/EupsBuildDir/Darwin/gauss2d_fit-g199a45376c+f63862d77a/gauss2d_fit-g199a45376c+f63862d77a/build-release/meson-private/tmp97m52l4l/testfile.cpp -E -P -ftree-vectorize -fPIC -fstack-protector-strong -O2 -pipe -stdlib=libc++ -fvisibility-inlines-hidden -fmessage-length=0 -isystem /Users/jenkins/j/workspace/release/tarball/eb40a89f6a/build/conda/envs/lsst-scipipe-12.1.0/include -D_FORTIFY_SOURCE=2 -isystem /Users/jenkins/j/workspace/release/tarball/eb40a89f6a/build/conda/envs/lsst-scipipe-12.1.0/include -mmacosx-version-min=14-arm -mmacosx-version-min=11.0 -P -O0 -fpermissive -Werror=implicit-function-declaration 

Code:
 
        #ifdef __has_include
         #if !__has_include("version")
          #error "Header 'version' could not be found"
         #endif
        #else
         #include <version>
        #endif
Cached compiler stdout:
 

Cached compiler stderr:
 
Using cached compile:
Cached command line:  arm64-apple-darwin20.0.0-clang++ /Users/jenkins/j/workspace/release/tarball/eb40a89f6a/build/conda/envs/lsst-scipipe-12.1.0/share/eups/EupsBuildDir/Darwin/gauss2d_fit-g199a45376c+f63862d77a/gauss2d_fit-g199a45376c+f63862d77a/build-release/meson-private/tmpe42uxog4/testfile.cpp -o /Users/jenkins/j/workspace/release/tarball/eb40a89f6a/build/conda/envs/lsst-scipipe-12.1.0/share/eups/EupsBuildDir/Darwin/gauss2d_fit-g199a45376c+f63862d77a/gauss2d_fit-g199a45376c+f63862d77a/build-release/meson-private/tmpe42uxog4/output.obj -c -ftree-vectorize -fPIC -fstack-protector-strong -O2 -pipe -stdlib=libc++ -fvisibility-inlines-hidden -fmessage-length=0 -isystem /Users/jenkins/j/workspace/release/tarball/eb40a89f6a/build/conda/envs/lsst-scipipe-12.1.0/include -D_FORTIFY_SOURCE=2 -isystem /Users/jenkins/j/workspace/release/tarball/eb40a89f6a/build/conda/envs/lsst-scipipe-12.1.0/include -mmacosx-version-min=14-arm -mmacosx-version-min=11.0 -O0 -fpermissive -Werror=implicit-function-declaration -Werror=unknown-warning-option -Werror=unused-command-line-argument -Werror=ignored-optimization-argument 

Code:
 
        #include <version>
        int main(void) {
            /* If it's not defined as a macro, try to use as a symbol */
            #ifndef _LIBCPP_VERSION
                _LIBCPP_VERSION;
            #endif
            return 0;
        }
Cached compiler stdout:
 
Cached compiler stderr:
 
Using cached compile:
Cached command line:  arm64-apple-darwin20.0.0-clang++ /Users/jenkins/j/workspace/release/tarball/eb40a89f6a/build/conda/envs/lsst-scipipe-12.1.0/share/eups/EupsBuildDir/Darwin/gauss2d_fit-g199a45376c+f63862d77a/gauss2d_fit-g199a45376c+f63862d77a/build-release/meson-private/tmp97m52l4l/testfile.cpp -E -P -ftree-vectorize -fPIC -fstack-protector-strong -O2 -pipe -stdlib=libc++ -fvisibility-inlines-hidden -fmessage-length=0 -isystem /Users/jenkins/j/workspace/release/tarball/eb40a89f6a/build/conda/envs/lsst-scipipe-12.1.0/include -D_FORTIFY_SOURCE=2 -isystem /Users/jenkins/j/workspace/release/tarball/eb40a89f6a/build/conda/envs/lsst-scipipe-12.1.0/include -mmacosx-version-min=14-arm -mmacosx-version-min=11.0 -P -O0 -fpermissive -Werror=implicit-function-declaration 

Code:
 
        #ifdef __has_include
         #if !__has_include("version")
          #error "Header 'version' could not be found"
         #endif
        #else
         #include <version>
        #endif
Cached compiler stdout:
 

Cached compiler stderr:
 
Using cached compile:
Cached command line:  arm64-apple-darwin20.0.0-clang++ /Users/jenkins/j/workspace/release/tarball/eb40a89f6a/build/conda/envs/lsst-scipipe-12.1.0/share/eups/EupsBuildDir/Darwin/gauss2d_fit-g199a45376c+f63862d77a/gauss2d_fit-g199a45376c+f63862d77a/build-release/meson-private/tmpe42uxog4/testfile.cpp -o /Users/jenkins/j/workspace/release/tarball/eb40a89f6a/build/conda/envs/lsst-scipipe-12.1.0/share/eups/EupsBuildDir/Darwin/gauss2d_fit-g199a45376c+f63862d77a/gauss2d_fit-g199a45376c+f63862d77a/build-release/meson-private/tmpe42uxog4/output.obj -c -ftree-vectorize -fPIC -fstack-protector-strong -O2 -pipe -stdlib=libc++ -fvisibility-inlines-hidden -fmessage-length=0 -isystem /Users/jenkins/j/workspace/release/tarball/eb40a89f6a/build/conda/envs/lsst-scipipe-12.1.0/include -D_FORTIFY_SOURCE=2 -isystem /Users/jenkins/j/workspace/release/tarball/eb40a89f6a/build/conda/envs/lsst-scipipe-12.1.0/include -mmacosx-version-min=14-arm -mmacosx-version-min=11.0 -O0 -fpermissive -Werror=implicit-function-declaration -Werror=unknown-warning-option -Werror=unused-command-line-argument -Werror=ignored-optimization-argument 

Code:
 
        #include <version>
        int main(void) {
            /* If it's not defined as a macro, try to use as a symbol */
            #ifndef _LIBCPP_VERSION
                _LIBCPP_VERSION;
            #endif
            return 0;
        }
Cached compiler stdout:
 
Cached compiler stderr:
 
Using cached compile:
Cached command line:  arm64-apple-darwin20.0.0-clang++ /Users/jenkins/j/workspace/release/tarball/eb40a89f6a/build/conda/envs/lsst-scipipe-12.1.0/share/eups/EupsBuildDir/Darwin/gauss2d_fit-g199a45376c+f63862d77a/gauss2d_fit-g199a45376c+f63862d77a/build-release/meson-private/tmp97m52l4l/testfile.cpp -E -P -ftree-vectorize -fPIC -fstack-protector-strong -O2 -pipe -stdlib=libc++ -fvisibility-inlines-hidden -fmessage-length=0 -isystem /Users/jenkins/j/workspace/release/tarball/eb40a89f6a/build/conda/envs/lsst-scipipe-12.1.0/include -D_FORTIFY_SOURCE=2 -isystem /Users/jenkins/j/workspace/release/tarball/eb40a89f6a/build/conda/envs/lsst-scipipe-12.1.0/include -mmacosx-version-min=14-arm -mmacosx-version-min=11.0 -P -O0 -fpermissive -Werror=implicit-function-declaration 

Code:
 
        #ifdef __has_include
         #if !__has_include("version")
          #error "Header 'version' could not be found"
         #endif
        #else
         #include <version>
        #endif
Cached compiler stdout:
 

Cached compiler stderr:
 
Using cached compile:
Cached command line:  arm64-apple-darwin20.0.0-clang++ /Users/jenkins/j/workspace/release/tarball/eb40a89f6a/build/conda/envs/lsst-scipipe-12.1.0/share/eups/EupsBuildDir/Darwin/gauss2d_fit-g199a45376c+f63862d77a/gauss2d_fit-g199a45376c+f63862d77a/build-release/meson-private/tmpe42uxog4/testfile.cpp -o /Users/jenkins/j/workspace/release/tarball/eb40a89f6a/build/conda/envs/lsst-scipipe-12.1.0/share/eups/EupsBuildDir/Darwin/gauss2d_fit-g199a45376c+f63862d77a/gauss2d_fit-g199a45376c+f63862d77a/build-release/meson-private/tmpe42uxog4/output.obj -c -ftree-vectorize -fPIC -fstack-protector-strong -O2 -pipe -stdlib=libc++ -fvisibility-inlines-hidden -fmessage-length=0 -isystem /Users/jenkins/j/workspace/release/tarball/eb40a89f6a/build/conda/envs/lsst-scipipe-12.1.0/include -D_FORTIFY_SOURCE=2 -isystem /Users/jenkins/j/workspace/release/tarball/eb40a89f6a/build/conda/envs/lsst-scipipe-12.1.0/include -mmacosx-version-min=14-arm -mmacosx-version-min=11.0 -O0 -fpermissive -Werror=implicit-function-declaration -Werror=unknown-warning-option -Werror=unused-command-line-argument -Werror=ignored-optimization-argument 

Code:
 
        #include <version>
        int main(void) {
            /* If it's not defined as a macro, try to use as a symbol */
            #ifndef _LIBCPP_VERSION
                _LIBCPP_VERSION;
            #endif
            return 0;
        }
Cached compiler stdout:
 
Cached compiler stderr:
 
Using cached compile:
Cached command line:  arm64-apple-darwin20.0.0-clang++ /Users/jenkins/j/workspace/release/tarball/eb40a89f6a/build/conda/envs/lsst-scipipe-12.1.0/share/eups/EupsBuildDir/Darwin/gauss2d_fit-g199a45376c+f63862d77a/gauss2d_fit-g199a45376c+f63862d77a/build-release/meson-private/tmp97m52l4l/testfile.cpp -E -P -ftree-vectorize -fPIC -fstack-protector-strong -O2 -pipe -stdlib=libc++ -fvisibility-inlines-hidden -fmessage-length=0 -isystem /Users/jenkins/j/workspace/release/tarball/eb40a89f6a/build/conda/envs/lsst-scipipe-12.1.0/include -D_FORTIFY_SOURCE=2 -isystem /Users/jenkins/j/workspace/release/tarball/eb40a89f6a/build/conda/envs/lsst-scipipe-12.1.0/include -mmacosx-version-min=14-arm -mmacosx-version-min=11.0 -P -O0 -fpermissive -Werror=implicit-function-declaration 

Code:
 
        #ifdef __has_include
         #if !__has_include("version")
          #error "Header 'version' could not be found"
         #endif
        #else
         #include <version>
        #endif
Cached compiler stdout:
 

Cached compiler stderr:
 
Using cached compile:
Cached command line:  arm64-apple-darwin20.0.0-clang++ /Users/jenkins/j/workspace/release/tarball/eb40a89f6a/build/conda/envs/lsst-scipipe-12.1.0/share/eups/EupsBuildDir/Darwin/gauss2d_fit-g199a45376c+f63862d77a/gauss2d_fit-g199a45376c+f63862d77a/build-release/meson-private/tmpe42uxog4/testfile.cpp -o /Users/jenkins/j/workspace/release/tarball/eb40a89f6a/build/conda/envs/lsst-scipipe-12.1.0/share/eups/EupsBuildDir/Darwin/gauss2d_fit-g199a45376c+f63862d77a/gauss2d_fit-g199a45376c+f63862d77a/build-release/meson-private/tmpe42uxog4/output.obj -c -ftree-vectorize -fPIC -fstack-protector-strong -O2 -pipe -stdlib=libc++ -fvisibility-inlines-hidden -fmessage-length=0 -isystem /Users/jenkins/j/workspace/release/tarball/eb40a89f6a/build/conda/envs/lsst-scipipe-12.1.0/include -D_FORTIFY_SOURCE=2 -isystem /Users/jenkins/j/workspace/release/tarball/eb40a89f6a/build/conda/envs/lsst-scipipe-12.1.0/include -mmacosx-version-min=14-arm -mmacosx-version-min=11.0 -O0 -fpermissive -Werror=implicit-function-declaration -Werror=unknown-warning-option -Werror=unused-command-line-argument -Werror=ignored-optimization-argument 

Code:
 
        #include <version>
        int main(void) {
            /* If it's not defined as a macro, try to use as a symbol */
            #ifndef _LIBCPP_VERSION
                _LIBCPP_VERSION;
            #endif
            return 0;
        }
Cached compiler stdout:
 
Cached compiler stderr:
 
Using cached compile:
Cached command line:  arm64-apple-darwin20.0.0-clang++ /Users/jenkins/j/workspace/release/tarball/eb40a89f6a/build/conda/envs/lsst-scipipe-12.1.0/share/eups/EupsBuildDir/Darwin/gauss2d_fit-g199a45376c+f63862d77a/gauss2d_fit-g199a45376c+f63862d77a/build-release/meson-private/tmp97m52l4l/testfile.cpp -E -P -ftree-vectorize -fPIC -fstack-protector-strong -O2 -pipe -stdlib=libc++ -fvisibility-inlines-hidden -fmessage-length=0 -isystem /Users/jenkins/j/workspace/release/tarball/eb40a89f6a/build/conda/envs/lsst-scipipe-12.1.0/include -D_FORTIFY_SOURCE=2 -isystem /Users/jenkins/j/workspace/release/tarball/eb40a89f6a/build/conda/envs/lsst-scipipe-12.1.0/include -mmacosx-version-min=14-arm -mmacosx-version-min=11.0 -P -O0 -fpermissive -Werror=implicit-function-declaration 

Code:
 
        #ifdef __has_include
         #if !__has_include("version")
          #error "Header 'version' could not be found"
         #endif
        #else
         #include <version>
        #endif
Cached compiler stdout:
 

Cached compiler stderr:
 
Using cached compile:
Cached command line:  arm64-apple-darwin20.0.0-clang++ /Users/jenkins/j/workspace/release/tarball/eb40a89f6a/build/conda/envs/lsst-scipipe-12.1.0/share/eups/EupsBuildDir/Darwin/gauss2d_fit-g199a45376c+f63862d77a/gauss2d_fit-g199a45376c+f63862d77a/build-release/meson-private/tmpe42uxog4/testfile.cpp -o /Users/jenkins/j/workspace/release/tarball/eb40a89f6a/build/conda/envs/lsst-scipipe-12.1.0/share/eups/EupsBuildDir/Darwin/gauss2d_fit-g199a45376c+f63862d77a/gauss2d_fit-g199a45376c+f63862d77a/build-release/meson-private/tmpe42uxog4/output.obj -c -ftree-vectorize -fPIC -fstack-protector-strong -O2 -pipe -stdlib=libc++ -fvisibility-inlines-hidden -fmessage-length=0 -isystem /Users/jenkins/j/workspace/release/tarball/eb40a89f6a/build/conda/envs/lsst-scipipe-12.1.0/include -D_FORTIFY_SOURCE=2 -isystem /Users/jenkins/j/workspace/release/tarball/eb40a89f6a/build/conda/envs/lsst-scipipe-12.1.0/include -mmacosx-version-min=14-arm -mmacosx-version-min=11.0 -O0 -fpermissive -Werror=implicit-function-declaration -Werror=unknown-warning-option -Werror=unused-command-line-argument -Werror=ignored-optimization-argument 

Code:
 
        #include <version>
        int main(void) {
            /* If it's not defined as a macro, try to use as a symbol */
            #ifndef _LIBCPP_VERSION
                _LIBCPP_VERSION;
            #endif
            return 0;
        }
Cached compiler stdout:
 
Cached compiler stderr:
 
Using cached compile:
Cached command line:  arm64-apple-darwin20.0.0-clang++ /Users/jenkins/j/workspace/release/tarball/eb40a89f6a/build/conda/envs/lsst-scipipe-12.1.0/share/eups/EupsBuildDir/Darwin/gauss2d_fit-g199a45376c+f63862d77a/gauss2d_fit-g199a45376c+f63862d77a/build-release/meson-private/tmp97m52l4l/testfile.cpp -E -P -ftree-vectorize -fPIC -fstack-protector-strong -O2 -pipe -stdlib=libc++ -fvisibility-inlines-hidden -fmessage-length=0 -isystem /Users/jenkins/j/workspace/release/tarball/eb40a89f6a/build/conda/envs/lsst-scipipe-12.1.0/include -D_FORTIFY_SOURCE=2 -isystem /Users/jenkins/j/workspace/release/tarball/eb40a89f6a/build/conda/envs/lsst-scipipe-12.1.0/include -mmacosx-version-min=14-arm -mmacosx-version-min=11.0 -P -O0 -fpermissive -Werror=implicit-function-declaration 

Code:
 
        #ifdef __has_include
         #if !__has_include("version")
          #error "Header 'version' could not be found"
         #endif
        #else
         #include <version>
        #endif
Cached compiler stdout:
 

Cached compiler stderr:
 
Using cached compile:
Cached command line:  arm64-apple-darwin20.0.0-clang++ /Users/jenkins/j/workspace/release/tarball/eb40a89f6a/build/conda/envs/lsst-scipipe-12.1.0/share/eups/EupsBuildDir/Darwin/gauss2d_fit-g199a45376c+f63862d77a/gauss2d_fit-g199a45376c+f63862d77a/build-release/meson-private/tmpe42uxog4/testfile.cpp -o /Users/jenkins/j/workspace/release/tarball/eb40a89f6a/build/conda/envs/lsst-scipipe-12.1.0/share/eups/EupsBuildDir/Darwin/gauss2d_fit-g199a45376c+f63862d77a/gauss2d_fit-g199a45376c+f63862d77a/build-release/meson-private/tmpe42uxog4/output.obj -c -ftree-vectorize -fPIC -fstack-protector-strong -O2 -pipe -stdlib=libc++ -fvisibility-inlines-hidden -fmessage-length=0 -isystem /Users/jenkins/j/workspace/release/tarball/eb40a89f6a/build/conda/envs/lsst-scipipe-12.1.0/include -D_FORTIFY_SOURCE=2 -isystem /Users/jenkins/j/workspace/release/tarball/eb40a89f6a/build/conda/envs/lsst-scipipe-12.1.0/include -mmacosx-version-min=14-arm -mmacosx-version-min=11.0 -O0 -fpermissive -Werror=implicit-function-declaration -Werror=unknown-warning-option -Werror=unused-command-line-argument -Werror=ignored-optimization-argument 

Code:
 
        #include <version>
        int main(void) {
            /* If it's not defined as a macro, try to use as a symbol */
            #ifndef _LIBCPP_VERSION
                _LIBCPP_VERSION;
            #endif
            return 0;
        }
Cached compiler stdout:
 
Cached compiler stderr:
 
Using cached compile:
Cached command line:  arm64-apple-darwin20.0.0-clang++ /Users/jenkins/j/workspace/release/tarball/eb40a89f6a/build/conda/envs/lsst-scipipe-12.1.0/share/eups/EupsBuildDir/Darwin/gauss2d_fit-g199a45376c+f63862d77a/gauss2d_fit-g199a45376c+f63862d77a/build-release/meson-private/tmp97m52l4l/testfile.cpp -E -P -ftree-vectorize -fPIC -fstack-protector-strong -O2 -pipe -stdlib=libc++ -fvisibility-inlines-hidden -fmessage-length=0 -isystem /Users/jenkins/j/workspace/release/tarball/eb40a89f6a/build/conda/envs/lsst-scipipe-12.1.0/include -D_FORTIFY_SOURCE=2 -isystem /Users/jenkins/j/workspace/release/tarball/eb40a89f6a/build/conda/envs/lsst-scipipe-12.1.0/include -mmacosx-version-min=14-arm -mmacosx-version-min=11.0 -P -O0 -fpermissive -Werror=implicit-function-declaration 

Code:
 
        #ifdef __has_include
         #if !__has_include("version")
          #error "Header 'version' could not be found"
         #endif
        #else
         #include <version>
        #endif
Cached compiler stdout:
 

Cached compiler stderr:
 
Using cached compile:
Cached command line:  arm64-apple-darwin20.0.0-clang++ /Users/jenkins/j/workspace/release/tarball/eb40a89f6a/build/conda/envs/lsst-scipipe-12.1.0/share/eups/EupsBuildDir/Darwin/gauss2d_fit-g199a45376c+f63862d77a/gauss2d_fit-g199a45376c+f63862d77a/build-release/meson-private/tmpe42uxog4/testfile.cpp -o /Users/jenkins/j/workspace/release/tarball/eb40a89f6a/build/conda/envs/lsst-scipipe-12.1.0/share/eups/EupsBuildDir/Darwin/gauss2d_fit-g199a45376c+f63862d77a/gauss2d_fit-g199a45376c+f63862d77a/build-release/meson-private/tmpe42uxog4/output.obj -c -ftree-vectorize -fPIC -fstack-protector-strong -O2 -pipe -stdlib=libc++ -fvisibility-inlines-hidden -fmessage-length=0 -isystem /Users/jenkins/j/workspace/release/tarball/eb40a89f6a/build/conda/envs/lsst-scipipe-12.1.0/include -D_FORTIFY_SOURCE=2 -isystem /Users/jenkins/j/workspace/release/tarball/eb40a89f6a/build/conda/envs/lsst-scipipe-12.1.0/include -mmacosx-version-min=14-arm -mmacosx-version-min=11.0 -O0 -fpermissive -Werror=implicit-function-declaration -Werror=unknown-warning-option -Werror=unused-command-line-argument -Werror=ignored-optimization-argument 

Code:
 
        #include <version>
        int main(void) {
            /* If it's not defined as a macro, try to use as a symbol */
            #ifndef _LIBCPP_VERSION
                _LIBCPP_VERSION;
            #endif
            return 0;
        }
Cached compiler stdout:
 
Cached compiler stderr:
 
Using cached compile:
Cached command line:  arm64-apple-darwin20.0.0-clang++ /Users/jenkins/j/workspace/release/tarball/eb40a89f6a/build/conda/envs/lsst-scipipe-12.1.0/share/eups/EupsBuildDir/Darwin/gauss2d_fit-g199a45376c+f63862d77a/gauss2d_fit-g199a45376c+f63862d77a/build-release/meson-private/tmp97m52l4l/testfile.cpp -E -P -ftree-vectorize -fPIC -fstack-protector-strong -O2 -pipe -stdlib=libc++ -fvisibility-inlines-hidden -fmessage-length=0 -isystem /Users/jenkins/j/workspace/release/tarball/eb40a89f6a/build/conda/envs/lsst-scipipe-12.1.0/include -D_FORTIFY_SOURCE=2 -isystem /Users/jenkins/j/workspace/release/tarball/eb40a89f6a/build/conda/envs/lsst-scipipe-12.1.0/include -mmacosx-version-min=14-arm -mmacosx-version-min=11.0 -P -O0 -fpermissive -Werror=implicit-function-declaration 

Code:
 
        #ifdef __has_include
         #if !__has_include("version")
          #error "Header 'version' could not be found"
         #endif
        #else
         #include <version>
        #endif
Cached compiler stdout:
 

Cached compiler stderr:
 
Using cached compile:
Cached command line:  arm64-apple-darwin20.0.0-clang++ /Users/jenkins/j/workspace/release/tarball/eb40a89f6a/build/conda/envs/lsst-scipipe-12.1.0/share/eups/EupsBuildDir/Darwin/gauss2d_fit-g199a45376c+f63862d77a/gauss2d_fit-g199a45376c+f63862d77a/build-release/meson-private/tmpe42uxog4/testfile.cpp -o /Users/jenkins/j/workspace/release/tarball/eb40a89f6a/build/conda/envs/lsst-scipipe-12.1.0/share/eups/EupsBuildDir/Darwin/gauss2d_fit-g199a45376c+f63862d77a/gauss2d_fit-g199a45376c+f63862d77a/build-release/meson-private/tmpe42uxog4/output.obj -c -ftree-vectorize -fPIC -fstack-protector-strong -O2 -pipe -stdlib=libc++ -fvisibility-inlines-hidden -fmessage-length=0 -isystem /Users/jenkins/j/workspace/release/tarball/eb40a89f6a/build/conda/envs/lsst-scipipe-12.1.0/include -D_FORTIFY_SOURCE=2 -isystem /Users/jenkins/j/workspace/release/tarball/eb40a89f6a/build/conda/envs/lsst-scipipe-12.1.0/include -mmacosx-version-min=14-arm -mmacosx-version-min=11.0 -O0 -fpermissive -Werror=implicit-function-declaration -Werror=unknown-warning-option -Werror=unused-command-line-argument -Werror=ignored-optimization-argument 

Code:
 
        #include <version>
        int main(void) {
            /* If it's not defined as a macro, try to use as a symbol */
            #ifndef _LIBCPP_VERSION
                _LIBCPP_VERSION;
            #endif
            return 0;
        }
Cached compiler stdout:
 
Cached compiler stderr:
 
Using cached compile:
Cached command line:  arm64-apple-darwin20.0.0-clang++ /Users/jenkins/j/workspace/release/tarball/eb40a89f6a/build/conda/envs/lsst-scipipe-12.1.0/share/eups/EupsBuildDir/Darwin/gauss2d_fit-g199a45376c+f63862d77a/gauss2d_fit-g199a45376c+f63862d77a/build-release/meson-private/tmp97m52l4l/testfile.cpp -E -P -ftree-vectorize -fPIC -fstack-protector-strong -O2 -pipe -stdlib=libc++ -fvisibility-inlines-hidden -fmessage-length=0 -isystem /Users/jenkins/j/workspace/release/tarball/eb40a89f6a/build/conda/envs/lsst-scipipe-12.1.0/include -D_FORTIFY_SOURCE=2 -isystem /Users/jenkins/j/workspace/release/tarball/eb40a89f6a/build/conda/envs/lsst-scipipe-12.1.0/include -mmacosx-version-min=14-arm -mmacosx-version-min=11.0 -P -O0 -fpermissive -Werror=implicit-function-declaration 

Code:
 
        #ifdef __has_include
         #if !__has_include("version")
          #error "Header 'version' could not be found"
         #endif
        #else
         #include <version>
        #endif
Cached compiler stdout:
 

Cached compiler stderr:
 
Using cached compile:
Cached command line:  arm64-apple-darwin20.0.0-clang++ /Users/jenkins/j/workspace/release/tarball/eb40a89f6a/build/conda/envs/lsst-scipipe-12.1.0/share/eups/EupsBuildDir/Darwin/gauss2d_fit-g199a45376c+f63862d77a/gauss2d_fit-g199a45376c+f63862d77a/build-release/meson-private/tmpe42uxog4/testfile.cpp -o /Users/jenkins/j/workspace/release/tarball/eb40a89f6a/build/conda/envs/lsst-scipipe-12.1.0/share/eups/EupsBuildDir/Darwin/gauss2d_fit-g199a45376c+f63862d77a/gauss2d_fit-g199a45376c+f63862d77a/build-release/meson-private/tmpe42uxog4/output.obj -c -ftree-vectorize -fPIC -fstack-protector-strong -O2 -pipe -stdlib=libc++ -fvisibility-inlines-hidden -fmessage-length=0 -isystem /Users/jenkins/j/workspace/release/tarball/eb40a89f6a/build/conda/envs/lsst-scipipe-12.1.0/include -D_FORTIFY_SOURCE=2 -isystem /Users/jenkins/j/workspace/release/tarball/eb40a89f6a/build/conda/envs/lsst-scipipe-12.1.0/include -mmacosx-version-min=14-arm -mmacosx-version-min=11.0 -O0 -fpermissive -Werror=implicit-function-declaration -Werror=unknown-warning-option -Werror=unused-command-line-argument -Werror=ignored-optimization-argument 

Code:
 
        #include <version>
        int main(void) {
            /* If it's not defined as a macro, try to use as a symbol */
            #ifndef _LIBCPP_VERSION
                _LIBCPP_VERSION;
            #endif
            return 0;
        }
Cached compiler stdout:
 
Cached compiler stderr:
 
Using cached compile:
Cached command line:  arm64-apple-darwin20.0.0-clang++ /Users/jenkins/j/workspace/release/tarball/eb40a89f6a/build/conda/envs/lsst-scipipe-12.1.0/share/eups/EupsBuildDir/Darwin/gauss2d_fit-g199a45376c+f63862d77a/gauss2d_fit-g199a45376c+f63862d77a/build-release/meson-private/tmp97m52l4l/testfile.cpp -E -P -ftree-vectorize -fPIC -fstack-protector-strong -O2 -pipe -stdlib=libc++ -fvisibility-inlines-hidden -fmessage-length=0 -isystem /Users/jenkins/j/workspace/release/tarball/eb40a89f6a/build/conda/envs/lsst-scipipe-12.1.0/include -D_FORTIFY_SOURCE=2 -isystem /Users/jenkins/j/workspace/release/tarball/eb40a89f6a/build/conda/envs/lsst-scipipe-12.1.0/include -mmacosx-version-min=14-arm -mmacosx-version-min=11.0 -P -O0 -fpermissive -Werror=implicit-function-declaration 

Code:
 
        #ifdef __has_include
         #if !__has_include("version")
          #error "Header 'version' could not be found"
         #endif
        #else
         #include <version>
        #endif
Cached compiler stdout:
 

Cached compiler stderr:
 
Using cached compile:
Cached command line:  arm64-apple-darwin20.0.0-clang++ /Users/jenkins/j/workspace/release/tarball/eb40a89f6a/build/conda/envs/lsst-scipipe-12.1.0/share/eups/EupsBuildDir/Darwin/gauss2d_fit-g199a45376c+f63862d77a/gauss2d_fit-g199a45376c+f63862d77a/build-release/meson-private/tmpe42uxog4/testfile.cpp -o /Users/jenkins/j/workspace/release/tarball/eb40a89f6a/build/conda/envs/lsst-scipipe-12.1.0/share/eups/EupsBuildDir/Darwin/gauss2d_fit-g199a45376c+f63862d77a/gauss2d_fit-g199a45376c+f63862d77a/build-release/meson-private/tmpe42uxog4/output.obj -c -ftree-vectorize -fPIC -fstack-protector-strong -O2 -pipe -stdlib=libc++ -fvisibility-inlines-hidden -fmessage-length=0 -isystem /Users/jenkins/j/workspace/release/tarball/eb40a89f6a/build/conda/envs/lsst-scipipe-12.1.0/include -D_FORTIFY_SOURCE=2 -isystem /Users/jenkins/j/workspace/release/tarball/eb40a89f6a/build/conda/envs/lsst-scipipe-12.1.0/include -mmacosx-version-min=14-arm -mmacosx-version-min=11.0 -O0 -fpermissive -Werror=implicit-function-declaration -Werror=unknown-warning-option -Werror=unused-command-line-argument -Werror=ignored-optimization-argument 

Code:
 
        #include <version>
        int main(void) {
            /* If it's not defined as a macro, try to use as a symbol */
            #ifndef _LIBCPP_VERSION
                _LIBCPP_VERSION;
            #endif
            return 0;
        }
Cached compiler stdout:
 
Cached compiler stderr:
 
Using cached compile:
Cached command line:  arm64-apple-darwin20.0.0-clang++ /Users/jenkins/j/workspace/release/tarball/eb40a89f6a/build/conda/envs/lsst-scipipe-12.1.0/share/eups/EupsBuildDir/Darwin/gauss2d_fit-g199a45376c+f63862d77a/gauss2d_fit-g199a45376c+f63862d77a/build-release/meson-private/tmp97m52l4l/testfile.cpp -E -P -ftree-vectorize -fPIC -fstack-protector-strong -O2 -pipe -stdlib=libc++ -fvisibility-inlines-hidden -fmessage-length=0 -isystem /Users/jenkins/j/workspace/release/tarball/eb40a89f6a/build/conda/envs/lsst-scipipe-12.1.0/include -D_FORTIFY_SOURCE=2 -isystem /Users/jenkins/j/workspace/release/tarball/eb40a89f6a/build/conda/envs/lsst-scipipe-12.1.0/include -mmacosx-version-min=14-arm -mmacosx-version-min=11.0 -P -O0 -fpermissive -Werror=implicit-function-declaration 

Code:
 
        #ifdef __has_include
         #if !__has_include("version")
          #error "Header 'version' could not be found"
         #endif
        #else
         #include <version>
        #endif
Cached compiler stdout:
 

Cached compiler stderr:
 
Using cached compile:
Cached command line:  arm64-apple-darwin20.0.0-clang++ /Users/jenkins/j/workspace/release/tarball/eb40a89f6a/build/conda/envs/lsst-scipipe-12.1.0/share/eups/EupsBuildDir/Darwin/gauss2d_fit-g199a45376c+f63862d77a/gauss2d_fit-g199a45376c+f63862d77a/build-release/meson-private/tmpe42uxog4/testfile.cpp -o /Users/jenkins/j/workspace/release/tarball/eb40a89f6a/build/conda/envs/lsst-scipipe-12.1.0/share/eups/EupsBuildDir/Darwin/gauss2d_fit-g199a45376c+f63862d77a/gauss2d_fit-g199a45376c+f63862d77a/build-release/meson-private/tmpe42uxog4/output.obj -c -ftree-vectorize -fPIC -fstack-protector-strong -O2 -pipe -stdlib=libc++ -fvisibility-inlines-hidden -fmessage-length=0 -isystem /Users/jenkins/j/workspace/release/tarball/eb40a89f6a/build/conda/envs/lsst-scipipe-12.1.0/include -D_FORTIFY_SOURCE=2 -isystem /Users/jenkins/j/workspace/release/tarball/eb40a89f6a/build/conda/envs/lsst-scipipe-12.1.0/include -mmacosx-version-min=14-arm -mmacosx-version-min=11.0 -O0 -fpermissive -Werror=implicit-function-declaration -Werror=unknown-warning-option -Werror=unused-command-line-argument -Werror=ignored-optimization-argument 

Code:
 
        #include <version>
        int main(void) {
            /* If it's not defined as a macro, try to use as a symbol */
            #ifndef _LIBCPP_VERSION
                _LIBCPP_VERSION;
            #endif
            return 0;
        }
Cached compiler stdout:
 
Cached compiler stderr:
 
Using cached compile:
Cached command line:  arm64-apple-darwin20.0.0-clang++ /Users/jenkins/j/workspace/release/tarball/eb40a89f6a/build/conda/envs/lsst-scipipe-12.1.0/share/eups/EupsBuildDir/Darwin/gauss2d_fit-g199a45376c+f63862d77a/gauss2d_fit-g199a45376c+f63862d77a/build-release/meson-private/tmp97m52l4l/testfile.cpp -E -P -ftree-vectorize -fPIC -fstack-protector-strong -O2 -pipe -stdlib=libc++ -fvisibility-inlines-hidden -fmessage-length=0 -isystem /Users/jenkins/j/workspace/release/tarball/eb40a89f6a/build/conda/envs/lsst-scipipe-12.1.0/include -D_FORTIFY_SOURCE=2 -isystem /Users/jenkins/j/workspace/release/tarball/eb40a89f6a/build/conda/envs/lsst-scipipe-12.1.0/include -mmacosx-version-min=14-arm -mmacosx-version-min=11.0 -P -O0 -fpermissive -Werror=implicit-function-declaration 

Code:
 
        #ifdef __has_include
         #if !__has_include("version")
          #error "Header 'version' could not be found"
         #endif
        #else
         #include <version>
        #endif
Cached compiler stdout:
 

Cached compiler stderr:
 
Using cached compile:
Cached command line:  arm64-apple-darwin20.0.0-clang++ /Users/jenkins/j/workspace/release/tarball/eb40a89f6a/build/conda/envs/lsst-scipipe-12.1.0/share/eups/EupsBuildDir/Darwin/gauss2d_fit-g199a45376c+f63862d77a/gauss2d_fit-g199a45376c+f63862d77a/build-release/meson-private/tmpe42uxog4/testfile.cpp -o /Users/jenkins/j/workspace/release/tarball/eb40a89f6a/build/conda/envs/lsst-scipipe-12.1.0/share/eups/EupsBuildDir/Darwin/gauss2d_fit-g199a45376c+f63862d77a/gauss2d_fit-g199a45376c+f63862d77a/build-release/meson-private/tmpe42uxog4/output.obj -c -ftree-vectorize -fPIC -fstack-protector-strong -O2 -pipe -stdlib=libc++ -fvisibility-inlines-hidden -fmessage-length=0 -isystem /Users/jenkins/j/workspace/release/tarball/eb40a89f6a/build/conda/envs/lsst-scipipe-12.1.0/include -D_FORTIFY_SOURCE=2 -isystem /Users/jenkins/j/workspace/release/tarball/eb40a89f6a/build/conda/envs/lsst-scipipe-12.1.0/include -mmacosx-version-min=14-arm -mmacosx-version-min=11.0 -O0 -fpermissive -Werror=implicit-function-declaration -Werror=unknown-warning-option -Werror=unused-command-line-argument -Werror=ignored-optimization-argument 

Code:
 
        #include <version>
        int main(void) {
            /* If it's not defined as a macro, try to use as a symbol */
            #ifndef _LIBCPP_VERSION
                _LIBCPP_VERSION;
            #endif
            return 0;
        }
Cached compiler stdout:
 
Cached compiler stderr:
 
Using cached compile:
Cached command line:  arm64-apple-darwin20.0.0-clang++ /Users/jenkins/j/workspace/release/tarball/eb40a89f6a/build/conda/envs/lsst-scipipe-12.1.0/share/eups/EupsBuildDir/Darwin/gauss2d_fit-g199a45376c+f63862d77a/gauss2d_fit-g199a45376c+f63862d77a/build-release/meson-private/tmp97m52l4l/testfile.cpp -E -P -ftree-vectorize -fPIC -fstack-protector-strong -O2 -pipe -stdlib=libc++ -fvisibility-inlines-hidden -fmessage-length=0 -isystem /Users/jenkins/j/workspace/release/tarball/eb40a89f6a/build/conda/envs/lsst-scipipe-12.1.0/include -D_FORTIFY_SOURCE=2 -isystem /Users/jenkins/j/workspace/release/tarball/eb40a89f6a/build/conda/envs/lsst-scipipe-12.1.0/include -mmacosx-version-min=14-arm -mmacosx-version-min=11.0 -P -O0 -fpermissive -Werror=implicit-function-declaration 

Code:
 
        #ifdef __has_include
         #if !__has_include("version")
          #error "Header 'version' could not be found"
         #endif
        #else
         #include <version>
        #endif
Cached compiler stdout:
 

Cached compiler stderr:
 
Using cached compile:
Cached command line:  arm64-apple-darwin20.0.0-clang++ /Users/jenkins/j/workspace/release/tarball/eb40a89f6a/build/conda/envs/lsst-scipipe-12.1.0/share/eups/EupsBuildDir/Darwin/gauss2d_fit-g199a45376c+f63862d77a/gauss2d_fit-g199a45376c+f63862d77a/build-release/meson-private/tmpe42uxog4/testfile.cpp -o /Users/jenkins/j/workspace/release/tarball/eb40a89f6a/build/conda/envs/lsst-scipipe-12.1.0/share/eups/EupsBuildDir/Darwin/gauss2d_fit-g199a45376c+f63862d77a/gauss2d_fit-g199a45376c+f63862d77a/build-release/meson-private/tmpe42uxog4/output.obj -c -ftree-vectorize -fPIC -fstack-protector-strong -O2 -pipe -stdlib=libc++ -fvisibility-inlines-hidden -fmessage-length=0 -isystem /Users/jenkins/j/workspace/release/tarball/eb40a89f6a/build/conda/envs/lsst-scipipe-12.1.0/include -D_FORTIFY_SOURCE=2 -isystem /Users/jenkins/j/workspace/release/tarball/eb40a89f6a/build/conda/envs/lsst-scipipe-12.1.0/include -mmacosx-version-min=14-arm -mmacosx-version-min=11.0 -O0 -fpermissive -Werror=implicit-function-declaration -Werror=unknown-warning-option -Werror=unused-command-line-argument -Werror=ignored-optimization-argument 

Code:
 
        #include <version>
        int main(void) {
            /* If it's not defined as a macro, try to use as a symbol */
            #ifndef _LIBCPP_VERSION
                _LIBCPP_VERSION;
            #endif
            return 0;
        }
Cached compiler stdout:
 
Cached compiler stderr:
 
Using cached compile:
Cached command line:  arm64-apple-darwin20.0.0-clang++ /Users/jenkins/j/workspace/release/tarball/eb40a89f6a/build/conda/envs/lsst-scipipe-12.1.0/share/eups/EupsBuildDir/Darwin/gauss2d_fit-g199a45376c+f63862d77a/gauss2d_fit-g199a45376c+f63862d77a/build-release/meson-private/tmp97m52l4l/testfile.cpp -E -P -ftree-vectorize -fPIC -fstack-protector-strong -O2 -pipe -stdlib=libc++ -fvisibility-inlines-hidden -fmessage-length=0 -isystem /Users/jenkins/j/workspace/release/tarball/eb40a89f6a/build/conda/envs/lsst-scipipe-12.1.0/include -D_FORTIFY_SOURCE=2 -isystem /Users/jenkins/j/workspace/release/tarball/eb40a89f6a/build/conda/envs/lsst-scipipe-12.1.0/include -mmacosx-version-min=14-arm -mmacosx-version-min=11.0 -P -O0 -fpermissive -Werror=implicit-function-declaration 

Code:
 
        #ifdef __has_include
         #if !__has_include("version")
          #error "Header 'version' could not be found"
         #endif
        #else
         #include <version>
        #endif
Cached compiler stdout:
 

Cached compiler stderr:
 
Using cached compile:
Cached command line:  arm64-apple-darwin20.0.0-clang++ /Users/jenkins/j/workspace/release/tarball/eb40a89f6a/build/conda/envs/lsst-scipipe-12.1.0/share/eups/EupsBuildDir/Darwin/gauss2d_fit-g199a45376c+f63862d77a/gauss2d_fit-g199a45376c+f63862d77a/build-release/meson-private/tmpe42uxog4/testfile.cpp -o /Users/jenkins/j/workspace/release/tarball/eb40a89f6a/build/conda/envs/lsst-scipipe-12.1.0/share/eups/EupsBuildDir/Darwin/gauss2d_fit-g199a45376c+f63862d77a/gauss2d_fit-g199a45376c+f63862d77a/build-release/meson-private/tmpe42uxog4/output.obj -c -ftree-vectorize -fPIC -fstack-protector-strong -O2 -pipe -stdlib=libc++ -fvisibility-inlines-hidden -fmessage-length=0 -isystem /Users/jenkins/j/workspace/release/tarball/eb40a89f6a/build/conda/envs/lsst-scipipe-12.1.0/include -D_FORTIFY_SOURCE=2 -isystem /Users/jenkins/j/workspace/release/tarball/eb40a89f6a/build/conda/envs/lsst-scipipe-12.1.0/include -mmacosx-version-min=14-arm -mmacosx-version-min=11.0 -O0 -fpermissive -Werror=implicit-function-declaration -Werror=unknown-warning-option -Werror=unused-command-line-argument -Werror=ignored-optimization-argument 

Code:
 
        #include <version>
        int main(void) {
            /* If it's not defined as a macro, try to use as a symbol */
            #ifndef _LIBCPP_VERSION
                _LIBCPP_VERSION;
            #endif
            return 0;
        }
Cached compiler stdout:
 
Cached compiler stderr:
 
Using cached compile:
Cached command line:  arm64-apple-darwin20.0.0-clang++ /Users/jenkins/j/workspace/release/tarball/eb40a89f6a/build/conda/envs/lsst-scipipe-12.1.0/share/eups/EupsBuildDir/Darwin/gauss2d_fit-g199a45376c+f63862d77a/gauss2d_fit-g199a45376c+f63862d77a/build-release/meson-private/tmp97m52l4l/testfile.cpp -E -P -ftree-vectorize -fPIC -fstack-protector-strong -O2 -pipe -stdlib=libc++ -fvisibility-inlines-hidden -fmessage-length=0 -isystem /Users/jenkins/j/workspace/release/tarball/eb40a89f6a/build/conda/envs/lsst-scipipe-12.1.0/include -D_FORTIFY_SOURCE=2 -isystem /Users/jenkins/j/workspace/release/tarball/eb40a89f6a/build/conda/envs/lsst-scipipe-12.1.0/include -mmacosx-version-min=14-arm -mmacosx-version-min=11.0 -P -O0 -fpermissive -Werror=implicit-function-declaration 

Code:
 
        #ifdef __has_include
         #if !__has_include("version")
          #error "Header 'version' could not be found"
         #endif
        #else
         #include <version>
        #endif
Cached compiler stdout:
 

Cached compiler stderr:
 
Using cached compile:
Cached command line:  arm64-apple-darwin20.0.0-clang++ /Users/jenkins/j/workspace/release/tarball/eb40a89f6a/build/conda/envs/lsst-scipipe-12.1.0/share/eups/EupsBuildDir/Darwin/gauss2d_fit-g199a45376c+f63862d77a/gauss2d_fit-g199a45376c+f63862d77a/build-release/meson-private/tmpe42uxog4/testfile.cpp -o /Users/jenkins/j/workspace/release/tarball/eb40a89f6a/build/conda/envs/lsst-scipipe-12.1.0/share/eups/EupsBuildDir/Darwin/gauss2d_fit-g199a45376c+f63862d77a/gauss2d_fit-g199a45376c+f63862d77a/build-release/meson-private/tmpe42uxog4/output.obj -c -ftree-vectorize -fPIC -fstack-protector-strong -O2 -pipe -stdlib=libc++ -fvisibility-inlines-hidden -fmessage-length=0 -isystem /Users/jenkins/j/workspace/release/tarball/eb40a89f6a/build/conda/envs/lsst-scipipe-12.1.0/include -D_FORTIFY_SOURCE=2 -isystem /Users/jenkins/j/workspace/release/tarball/eb40a89f6a/build/conda/envs/lsst-scipipe-12.1.0/include -mmacosx-version-min=14-arm -mmacosx-version-min=11.0 -O0 -fpermissive -Werror=implicit-function-declaration -Werror=unknown-warning-option -Werror=unused-command-line-argument -Werror=ignored-optimization-argument 

Code:
 
        #include <version>
        int main(void) {
            /* If it's not defined as a macro, try to use as a symbol */
            #ifndef _LIBCPP_VERSION
                _LIBCPP_VERSION;
            #endif
            return 0;
        }
Cached compiler stdout:
 
Cached compiler stderr:
 
Using cached compile:
Cached command line:  arm64-apple-darwin20.0.0-clang++ /Users/jenkins/j/workspace/release/tarball/eb40a89f6a/build/conda/envs/lsst-scipipe-12.1.0/share/eups/EupsBuildDir/Darwin/gauss2d_fit-g199a45376c+f63862d77a/gauss2d_fit-g199a45376c+f63862d77a/build-release/meson-private/tmp97m52l4l/testfile.cpp -E -P -ftree-vectorize -fPIC -fstack-protector-strong -O2 -pipe -stdlib=libc++ -fvisibility-inlines-hidden -fmessage-length=0 -isystem /Users/jenkins/j/workspace/release/tarball/eb40a89f6a/build/conda/envs/lsst-scipipe-12.1.0/include -D_FORTIFY_SOURCE=2 -isystem /Users/jenkins/j/workspace/release/tarball/eb40a89f6a/build/conda/envs/lsst-scipipe-12.1.0/include -mmacosx-version-min=14-arm -mmacosx-version-min=11.0 -P -O0 -fpermissive -Werror=implicit-function-declaration 

Code:
 
        #ifdef __has_include
         #if !__has_include("version")
          #error "Header 'version' could not be found"
         #endif
        #else
         #include <version>
        #endif
Cached compiler stdout:
 

Cached compiler stderr:
 
Using cached compile:
Cached command line:  arm64-apple-darwin20.0.0-clang++ /Users/jenkins/j/workspace/release/tarball/eb40a89f6a/build/conda/envs/lsst-scipipe-12.1.0/share/eups/EupsBuildDir/Darwin/gauss2d_fit-g199a45376c+f63862d77a/gauss2d_fit-g199a45376c+f63862d77a/build-release/meson-private/tmpe42uxog4/testfile.cpp -o /Users/jenkins/j/workspace/release/tarball/eb40a89f6a/build/conda/envs/lsst-scipipe-12.1.0/share/eups/EupsBuildDir/Darwin/gauss2d_fit-g199a45376c+f63862d77a/gauss2d_fit-g199a45376c+f63862d77a/build-release/meson-private/tmpe42uxog4/output.obj -c -ftree-vectorize -fPIC -fstack-protector-strong -O2 -pipe -stdlib=libc++ -fvisibility-inlines-hidden -fmessage-length=0 -isystem /Users/jenkins/j/workspace/release/tarball/eb40a89f6a/build/conda/envs/lsst-scipipe-12.1.0/include -D_FORTIFY_SOURCE=2 -isystem /Users/jenkins/j/workspace/release/tarball/eb40a89f6a/build/conda/envs/lsst-scipipe-12.1.0/include -mmacosx-version-min=14-arm -mmacosx-version-min=11.0 -O0 -fpermissive -Werror=implicit-function-declaration -Werror=unknown-warning-option -Werror=unused-command-line-argument -Werror=ignored-optimization-argument 

Code:
 
        #include <version>
        int main(void) {
            /* If it's not defined as a macro, try to use as a symbol */
            #ifndef _LIBCPP_VERSION
                _LIBCPP_VERSION;
            #endif
            return 0;
        }
Cached compiler stdout:
 
Cached compiler stderr:
 
Using cached compile:
Cached command line:  arm64-apple-darwin20.0.0-clang++ /Users/jenkins/j/workspace/release/tarball/eb40a89f6a/build/conda/envs/lsst-scipipe-12.1.0/share/eups/EupsBuildDir/Darwin/gauss2d_fit-g199a45376c+f63862d77a/gauss2d_fit-g199a45376c+f63862d77a/build-release/meson-private/tmp97m52l4l/testfile.cpp -E -P -ftree-vectorize -fPIC -fstack-protector-strong -O2 -pipe -stdlib=libc++ -fvisibility-inlines-hidden -fmessage-length=0 -isystem /Users/jenkins/j/workspace/release/tarball/eb40a89f6a/build/conda/envs/lsst-scipipe-12.1.0/include -D_FORTIFY_SOURCE=2 -isystem /Users/jenkins/j/workspace/release/tarball/eb40a89f6a/build/conda/envs/lsst-scipipe-12.1.0/include -mmacosx-version-min=14-arm -mmacosx-version-min=11.0 -P -O0 -fpermissive -Werror=implicit-function-declaration 

Code:
 
        #ifdef __has_include
         #if !__has_include("version")
          #error "Header 'version' could not be found"
         #endif
        #else
         #include <version>
        #endif
Cached compiler stdout:
 

Cached compiler stderr:
 
Using cached compile:
Cached command line:  arm64-apple-darwin20.0.0-clang++ /Users/jenkins/j/workspace/release/tarball/eb40a89f6a/build/conda/envs/lsst-scipipe-12.1.0/share/eups/EupsBuildDir/Darwin/gauss2d_fit-g199a45376c+f63862d77a/gauss2d_fit-g199a45376c+f63862d77a/build-release/meson-private/tmpe42uxog4/testfile.cpp -o /Users/jenkins/j/workspace/release/tarball/eb40a89f6a/build/conda/envs/lsst-scipipe-12.1.0/share/eups/EupsBuildDir/Darwin/gauss2d_fit-g199a45376c+f63862d77a/gauss2d_fit-g199a45376c+f63862d77a/build-release/meson-private/tmpe42uxog4/output.obj -c -ftree-vectorize -fPIC -fstack-protector-strong -O2 -pipe -stdlib=libc++ -fvisibility-inlines-hidden -fmessage-length=0 -isystem /Users/jenkins/j/workspace/release/tarball/eb40a89f6a/build/conda/envs/lsst-scipipe-12.1.0/include -D_FORTIFY_SOURCE=2 -isystem /Users/jenkins/j/workspace/release/tarball/eb40a89f6a/build/conda/envs/lsst-scipipe-12.1.0/include -mmacosx-version-min=14-arm -mmacosx-version-min=11.0 -O0 -fpermissive -Werror=implicit-function-declaration -Werror=unknown-warning-option -Werror=unused-command-line-argument -Werror=ignored-optimization-argument 

Code:
 
        #include <version>
        int main(void) {
            /* If it's not defined as a macro, try to use as a symbol */
            #ifndef _LIBCPP_VERSION
                _LIBCPP_VERSION;
            #endif
            return 0;
        }
Cached compiler stdout:
 
Cached compiler stderr:
 
Using cached compile:
Cached command line:  arm64-apple-darwin20.0.0-clang++ /Users/jenkins/j/workspace/release/tarball/eb40a89f6a/build/conda/envs/lsst-scipipe-12.1.0/share/eups/EupsBuildDir/Darwin/gauss2d_fit-g199a45376c+f63862d77a/gauss2d_fit-g199a45376c+f63862d77a/build-release/meson-private/tmp97m52l4l/testfile.cpp -E -P -ftree-vectorize -fPIC -fstack-protector-strong -O2 -pipe -stdlib=libc++ -fvisibility-inlines-hidden -fmessage-length=0 -isystem /Users/jenkins/j/workspace/release/tarball/eb40a89f6a/build/conda/envs/lsst-scipipe-12.1.0/include -D_FORTIFY_SOURCE=2 -isystem /Users/jenkins/j/workspace/release/tarball/eb40a89f6a/build/conda/envs/lsst-scipipe-12.1.0/include -mmacosx-version-min=14-arm -mmacosx-version-min=11.0 -P -O0 -fpermissive -Werror=implicit-function-declaration 

Code:
 
        #ifdef __has_include
         #if !__has_include("version")
          #error "Header 'version' could not be found"
         #endif
        #else
         #include <version>
        #endif
Cached compiler stdout:
 

Cached compiler stderr:
 
Using cached compile:
Cached command line:  arm64-apple-darwin20.0.0-clang++ /Users/jenkins/j/workspace/release/tarball/eb40a89f6a/build/conda/envs/lsst-scipipe-12.1.0/share/eups/EupsBuildDir/Darwin/gauss2d_fit-g199a45376c+f63862d77a/gauss2d_fit-g199a45376c+f63862d77a/build-release/meson-private/tmpe42uxog4/testfile.cpp -o /Users/jenkins/j/workspace/release/tarball/eb40a89f6a/build/conda/envs/lsst-scipipe-12.1.0/share/eups/EupsBuildDir/Darwin/gauss2d_fit-g199a45376c+f63862d77a/gauss2d_fit-g199a45376c+f63862d77a/build-release/meson-private/tmpe42uxog4/output.obj -c -ftree-vectorize -fPIC -fstack-protector-strong -O2 -pipe -stdlib=libc++ -fvisibility-inlines-hidden -fmessage-length=0 -isystem /Users/jenkins/j/workspace/release/tarball/eb40a89f6a/build/conda/envs/lsst-scipipe-12.1.0/include -D_FORTIFY_SOURCE=2 -isystem /Users/jenkins/j/workspace/release/tarball/eb40a89f6a/build/conda/envs/lsst-scipipe-12.1.0/include -mmacosx-version-min=14-arm -mmacosx-version-min=11.0 -O0 -fpermissive -Werror=implicit-function-declaration -Werror=unknown-warning-option -Werror=unused-command-line-argument -Werror=ignored-optimization-argument 

Code:
 
        #include <version>
        int main(void) {
            /* If it's not defined as a macro, try to use as a symbol */
            #ifndef _LIBCPP_VERSION
                _LIBCPP_VERSION;
            #endif
            return 0;
        }
Cached compiler stdout:
 
Cached compiler stderr:
 
Using cached compile:
Cached command line:  arm64-apple-darwin20.0.0-clang++ /Users/jenkins/j/workspace/release/tarball/eb40a89f6a/build/conda/envs/lsst-scipipe-12.1.0/share/eups/EupsBuildDir/Darwin/gauss2d_fit-g199a45376c+f63862d77a/gauss2d_fit-g199a45376c+f63862d77a/build-release/meson-private/tmp97m52l4l/testfile.cpp -E -P -ftree-vectorize -fPIC -fstack-protector-strong -O2 -pipe -stdlib=libc++ -fvisibility-inlines-hidden -fmessage-length=0 -isystem /Users/jenkins/j/workspace/release/tarball/eb40a89f6a/build/conda/envs/lsst-scipipe-12.1.0/include -D_FORTIFY_SOURCE=2 -isystem /Users/jenkins/j/workspace/release/tarball/eb40a89f6a/build/conda/envs/lsst-scipipe-12.1.0/include -mmacosx-version-min=14-arm -mmacosx-version-min=11.0 -P -O0 -fpermissive -Werror=implicit-function-declaration 

Code:
 
        #ifdef __has_include
         #if !__has_include("version")
          #error "Header 'version' could not be found"
         #endif
        #else
         #include <version>
        #endif
Cached compiler stdout:
 

Cached compiler stderr:
 
Using cached compile:
Cached command line:  arm64-apple-darwin20.0.0-clang++ /Users/jenkins/j/workspace/release/tarball/eb40a89f6a/build/conda/envs/lsst-scipipe-12.1.0/share/eups/EupsBuildDir/Darwin/gauss2d_fit-g199a45376c+f63862d77a/gauss2d_fit-g199a45376c+f63862d77a/build-release/meson-private/tmpe42uxog4/testfile.cpp -o /Users/jenkins/j/workspace/release/tarball/eb40a89f6a/build/conda/envs/lsst-scipipe-12.1.0/share/eups/EupsBuildDir/Darwin/gauss2d_fit-g199a45376c+f63862d77a/gauss2d_fit-g199a45376c+f63862d77a/build-release/meson-private/tmpe42uxog4/output.obj -c -ftree-vectorize -fPIC -fstack-protector-strong -O2 -pipe -stdlib=libc++ -fvisibility-inlines-hidden -fmessage-length=0 -isystem /Users/jenkins/j/workspace/release/tarball/eb40a89f6a/build/conda/envs/lsst-scipipe-12.1.0/include -D_FORTIFY_SOURCE=2 -isystem /Users/jenkins/j/workspace/release/tarball/eb40a89f6a/build/conda/envs/lsst-scipipe-12.1.0/include -mmacosx-version-min=14-arm -mmacosx-version-min=11.0 -O0 -fpermissive -Werror=implicit-function-declaration -Werror=unknown-warning-option -Werror=unused-command-line-argument -Werror=ignored-optimization-argument 

Code:
 
        #include <version>
        int main(void) {
            /* If it's not defined as a macro, try to use as a symbol */
            #ifndef _LIBCPP_VERSION
                _LIBCPP_VERSION;
            #endif
            return 0;
        }
Cached compiler stdout:
 
Cached compiler stderr:
 
Using cached compile:
Cached command line:  arm64-apple-darwin20.0.0-clang++ /Users/jenkins/j/workspace/release/tarball/eb40a89f6a/build/conda/envs/lsst-scipipe-12.1.0/share/eups/EupsBuildDir/Darwin/gauss2d_fit-g199a45376c+f63862d77a/gauss2d_fit-g199a45376c+f63862d77a/build-release/meson-private/tmp97m52l4l/testfile.cpp -E -P -ftree-vectorize -fPIC -fstack-protector-strong -O2 -pipe -stdlib=libc++ -fvisibility-inlines-hidden -fmessage-length=0 -isystem /Users/jenkins/j/workspace/release/tarball/eb40a89f6a/build/conda/envs/lsst-scipipe-12.1.0/include -D_FORTIFY_SOURCE=2 -isystem /Users/jenkins/j/workspace/release/tarball/eb40a89f6a/build/conda/envs/lsst-scipipe-12.1.0/include -mmacosx-version-min=14-arm -mmacosx-version-min=11.0 -P -O0 -fpermissive -Werror=implicit-function-declaration 

Code:
 
        #ifdef __has_include
         #if !__has_include("version")
          #error "Header 'version' could not be found"
         #endif
        #else
         #include <version>
        #endif
Cached compiler stdout:
 

Cached compiler stderr:
 
Using cached compile:
Cached command line:  arm64-apple-darwin20.0.0-clang++ /Users/jenkins/j/workspace/release/tarball/eb40a89f6a/build/conda/envs/lsst-scipipe-12.1.0/share/eups/EupsBuildDir/Darwin/gauss2d_fit-g199a45376c+f63862d77a/gauss2d_fit-g199a45376c+f63862d77a/build-release/meson-private/tmpe42uxog4/testfile.cpp -o /Users/jenkins/j/workspace/release/tarball/eb40a89f6a/build/conda/envs/lsst-scipipe-12.1.0/share/eups/EupsBuildDir/Darwin/gauss2d_fit-g199a45376c+f63862d77a/gauss2d_fit-g199a45376c+f63862d77a/build-release/meson-private/tmpe42uxog4/output.obj -c -ftree-vectorize -fPIC -fstack-protector-strong -O2 -pipe -stdlib=libc++ -fvisibility-inlines-hidden -fmessage-length=0 -isystem /Users/jenkins/j/workspace/release/tarball/eb40a89f6a/build/conda/envs/lsst-scipipe-12.1.0/include -D_FORTIFY_SOURCE=2 -isystem /Users/jenkins/j/workspace/release/tarball/eb40a89f6a/build/conda/envs/lsst-scipipe-12.1.0/include -mmacosx-version-min=14-arm -mmacosx-version-min=11.0 -O0 -fpermissive -Werror=implicit-function-declaration -Werror=unknown-warning-option -Werror=unused-command-line-argument -Werror=ignored-optimization-argument 

Code:
 
        #include <version>
        int main(void) {
            /* If it's not defined as a macro, try to use as a symbol */
            #ifndef _LIBCPP_VERSION
                _LIBCPP_VERSION;
            #endif
            return 0;
        }
Cached compiler stdout:
 
Cached compiler stderr:
 
Using cached compile:
Cached command line:  arm64-apple-darwin20.0.0-clang++ /Users/jenkins/j/workspace/release/tarball/eb40a89f6a/build/conda/envs/lsst-scipipe-12.1.0/share/eups/EupsBuildDir/Darwin/gauss2d_fit-g199a45376c+f63862d77a/gauss2d_fit-g199a45376c+f63862d77a/build-release/meson-private/tmp97m52l4l/testfile.cpp -E -P -ftree-vectorize -fPIC -fstack-protector-strong -O2 -pipe -stdlib=libc++ -fvisibility-inlines-hidden -fmessage-length=0 -isystem /Users/jenkins/j/workspace/release/tarball/eb40a89f6a/build/conda/envs/lsst-scipipe-12.1.0/include -D_FORTIFY_SOURCE=2 -isystem /Users/jenkins/j/workspace/release/tarball/eb40a89f6a/build/conda/envs/lsst-scipipe-12.1.0/include -mmacosx-version-min=14-arm -mmacosx-version-min=11.0 -P -O0 -fpermissive -Werror=implicit-function-declaration 

Code:
 
        #ifdef __has_include
         #if !__has_include("version")
          #error "Header 'version' could not be found"
         #endif
        #else
         #include <version>
        #endif
Cached compiler stdout:
 

Cached compiler stderr:
 
Using cached compile:
Cached command line:  arm64-apple-darwin20.0.0-clang++ /Users/jenkins/j/workspace/release/tarball/eb40a89f6a/build/conda/envs/lsst-scipipe-12.1.0/share/eups/EupsBuildDir/Darwin/gauss2d_fit-g199a45376c+f63862d77a/gauss2d_fit-g199a45376c+f63862d77a/build-release/meson-private/tmpe42uxog4/testfile.cpp -o /Users/jenkins/j/workspace/release/tarball/eb40a89f6a/build/conda/envs/lsst-scipipe-12.1.0/share/eups/EupsBuildDir/Darwin/gauss2d_fit-g199a45376c+f63862d77a/gauss2d_fit-g199a45376c+f63862d77a/build-release/meson-private/tmpe42uxog4/output.obj -c -ftree-vectorize -fPIC -fstack-protector-strong -O2 -pipe -stdlib=libc++ -fvisibility-inlines-hidden -fmessage-length=0 -isystem /Users/jenkins/j/workspace/release/tarball/eb40a89f6a/build/conda/envs/lsst-scipipe-12.1.0/include -D_FORTIFY_SOURCE=2 -isystem /Users/jenkins/j/workspace/release/tarball/eb40a89f6a/build/conda/envs/lsst-scipipe-12.1.0/include -mmacosx-version-min=14-arm -mmacosx-version-min=11.0 -O0 -fpermissive -Werror=implicit-function-declaration -Werror=unknown-warning-option -Werror=unused-command-line-argument -Werror=ignored-optimization-argument 

Code:
 
        #include <version>
        int main(void) {
            /* If it's not defined as a macro, try to use as a symbol */
            #ifndef _LIBCPP_VERSION
                _LIBCPP_VERSION;
            #endif
            return 0;
        }
Cached compiler stdout:
 
Cached compiler stderr:
 
Using cached compile:
Cached command line:  arm64-apple-darwin20.0.0-clang++ /Users/jenkins/j/workspace/release/tarball/eb40a89f6a/build/conda/envs/lsst-scipipe-12.1.0/share/eups/EupsBuildDir/Darwin/gauss2d_fit-g199a45376c+f63862d77a/gauss2d_fit-g199a45376c+f63862d77a/build-release/meson-private/tmp97m52l4l/testfile.cpp -E -P -ftree-vectorize -fPIC -fstack-protector-strong -O2 -pipe -stdlib=libc++ -fvisibility-inlines-hidden -fmessage-length=0 -isystem /Users/jenkins/j/workspace/release/tarball/eb40a89f6a/build/conda/envs/lsst-scipipe-12.1.0/include -D_FORTIFY_SOURCE=2 -isystem /Users/jenkins/j/workspace/release/tarball/eb40a89f6a/build/conda/envs/lsst-scipipe-12.1.0/include -mmacosx-version-min=14-arm -mmacosx-version-min=11.0 -P -O0 -fpermissive -Werror=implicit-function-declaration 

Code:
 
        #ifdef __has_include
         #if !__has_include("version")
          #error "Header 'version' could not be found"
         #endif
        #else
         #include <version>
        #endif
Cached compiler stdout:
 

Cached compiler stderr:
 
Using cached compile:
Cached command line:  arm64-apple-darwin20.0.0-clang++ /Users/jenkins/j/workspace/release/tarball/eb40a89f6a/build/conda/envs/lsst-scipipe-12.1.0/share/eups/EupsBuildDir/Darwin/gauss2d_fit-g199a45376c+f63862d77a/gauss2d_fit-g199a45376c+f63862d77a/build-release/meson-private/tmpe42uxog4/testfile.cpp -o /Users/jenkins/j/workspace/release/tarball/eb40a89f6a/build/conda/envs/lsst-scipipe-12.1.0/share/eups/EupsBuildDir/Darwin/gauss2d_fit-g199a45376c+f63862d77a/gauss2d_fit-g199a45376c+f63862d77a/build-release/meson-private/tmpe42uxog4/output.obj -c -ftree-vectorize -fPIC -fstack-protector-strong -O2 -pipe -stdlib=libc++ -fvisibility-inlines-hidden -fmessage-length=0 -isystem /Users/jenkins/j/workspace/release/tarball/eb40a89f6a/build/conda/envs/lsst-scipipe-12.1.0/include -D_FORTIFY_SOURCE=2 -isystem /Users/jenkins/j/workspace/release/tarball/eb40a89f6a/build/conda/envs/lsst-scipipe-12.1.0/include -mmacosx-version-min=14-arm -mmacosx-version-min=11.0 -O0 -fpermissive -Werror=implicit-function-declaration -Werror=unknown-warning-option -Werror=unused-command-line-argument -Werror=ignored-optimization-argument 

Code:
 
        #include <version>
        int main(void) {
            /* If it's not defined as a macro, try to use as a symbol */
            #ifndef _LIBCPP_VERSION
                _LIBCPP_VERSION;
            #endif
            return 0;
        }
Cached compiler stdout:
 
Cached compiler stderr:
 
Using cached compile:
Cached command line:  arm64-apple-darwin20.0.0-clang++ /Users/jenkins/j/workspace/release/tarball/eb40a89f6a/build/conda/envs/lsst-scipipe-12.1.0/share/eups/EupsBuildDir/Darwin/gauss2d_fit-g199a45376c+f63862d77a/gauss2d_fit-g199a45376c+f63862d77a/build-release/meson-private/tmp97m52l4l/testfile.cpp -E -P -ftree-vectorize -fPIC -fstack-protector-strong -O2 -pipe -stdlib=libc++ -fvisibility-inlines-hidden -fmessage-length=0 -isystem /Users/jenkins/j/workspace/release/tarball/eb40a89f6a/build/conda/envs/lsst-scipipe-12.1.0/include -D_FORTIFY_SOURCE=2 -isystem /Users/jenkins/j/workspace/release/tarball/eb40a89f6a/build/conda/envs/lsst-scipipe-12.1.0/include -mmacosx-version-min=14-arm -mmacosx-version-min=11.0 -P -O0 -fpermissive -Werror=implicit-function-declaration 

Code:
 
        #ifdef __has_include
         #if !__has_include("version")
          #error "Header 'version' could not be found"
         #endif
        #else
         #include <version>
        #endif
Cached compiler stdout:
 

Cached compiler stderr:
 
Using cached compile:
Cached command line:  arm64-apple-darwin20.0.0-clang++ /Users/jenkins/j/workspace/release/tarball/eb40a89f6a/build/conda/envs/lsst-scipipe-12.1.0/share/eups/EupsBuildDir/Darwin/gauss2d_fit-g199a45376c+f63862d77a/gauss2d_fit-g199a45376c+f63862d77a/build-release/meson-private/tmpe42uxog4/testfile.cpp -o /Users/jenkins/j/workspace/release/tarball/eb40a89f6a/build/conda/envs/lsst-scipipe-12.1.0/share/eups/EupsBuildDir/Darwin/gauss2d_fit-g199a45376c+f63862d77a/gauss2d_fit-g199a45376c+f63862d77a/build-release/meson-private/tmpe42uxog4/output.obj -c -ftree-vectorize -fPIC -fstack-protector-strong -O2 -pipe -stdlib=libc++ -fvisibility-inlines-hidden -fmessage-length=0 -isystem /Users/jenkins/j/workspace/release/tarball/eb40a89f6a/build/conda/envs/lsst-scipipe-12.1.0/include -D_FORTIFY_SOURCE=2 -isystem /Users/jenkins/j/workspace/release/tarball/eb40a89f6a/build/conda/envs/lsst-scipipe-12.1.0/include -mmacosx-version-min=14-arm -mmacosx-version-min=11.0 -O0 -fpermissive -Werror=implicit-function-declaration -Werror=unknown-warning-option -Werror=unused-command-line-argument -Werror=ignored-optimization-argument 

Code:
 
        #include <version>
        int main(void) {
            /* If it's not defined as a macro, try to use as a symbol */
            #ifndef _LIBCPP_VERSION
                _LIBCPP_VERSION;
            #endif
            return 0;
        }
Cached compiler stdout:
 
Cached compiler stderr:
 
Using cached compile:
Cached command line:  arm64-apple-darwin20.0.0-clang++ /Users/jenkins/j/workspace/release/tarball/eb40a89f6a/build/conda/envs/lsst-scipipe-12.1.0/share/eups/EupsBuildDir/Darwin/gauss2d_fit-g199a45376c+f63862d77a/gauss2d_fit-g199a45376c+f63862d77a/build-release/meson-private/tmp97m52l4l/testfile.cpp -E -P -ftree-vectorize -fPIC -fstack-protector-strong -O2 -pipe -stdlib=libc++ -fvisibility-inlines-hidden -fmessage-length=0 -isystem /Users/jenkins/j/workspace/release/tarball/eb40a89f6a/build/conda/envs/lsst-scipipe-12.1.0/include -D_FORTIFY_SOURCE=2 -isystem /Users/jenkins/j/workspace/release/tarball/eb40a89f6a/build/conda/envs/lsst-scipipe-12.1.0/include -mmacosx-version-min=14-arm -mmacosx-version-min=11.0 -P -O0 -fpermissive -Werror=implicit-function-declaration 

Code:
 
        #ifdef __has_include
         #if !__has_include("version")
          #error "Header 'version' could not be found"
         #endif
        #else
         #include <version>
        #endif
Cached compiler stdout:
 

Cached compiler stderr:
 
Using cached compile:
Cached command line:  arm64-apple-darwin20.0.0-clang++ /Users/jenkins/j/workspace/release/tarball/eb40a89f6a/build/conda/envs/lsst-scipipe-12.1.0/share/eups/EupsBuildDir/Darwin/gauss2d_fit-g199a45376c+f63862d77a/gauss2d_fit-g199a45376c+f63862d77a/build-release/meson-private/tmpe42uxog4/testfile.cpp -o /Users/jenkins/j/workspace/release/tarball/eb40a89f6a/build/conda/envs/lsst-scipipe-12.1.0/share/eups/EupsBuildDir/Darwin/gauss2d_fit-g199a45376c+f63862d77a/gauss2d_fit-g199a45376c+f63862d77a/build-release/meson-private/tmpe42uxog4/output.obj -c -ftree-vectorize -fPIC -fstack-protector-strong -O2 -pipe -stdlib=libc++ -fvisibility-inlines-hidden -fmessage-length=0 -isystem /Users/jenkins/j/workspace/release/tarball/eb40a89f6a/build/conda/envs/lsst-scipipe-12.1.0/include -D_FORTIFY_SOURCE=2 -isystem /Users/jenkins/j/workspace/release/tarball/eb40a89f6a/build/conda/envs/lsst-scipipe-12.1.0/include -mmacosx-version-min=14-arm -mmacosx-version-min=11.0 -O0 -fpermissive -Werror=implicit-function-declaration -Werror=unknown-warning-option -Werror=unused-command-line-argument -Werror=ignored-optimization-argument 

Code:
 
        #include <version>
        int main(void) {
            /* If it's not defined as a macro, try to use as a symbol */
            #ifndef _LIBCPP_VERSION
                _LIBCPP_VERSION;
            #endif
            return 0;
        }
Cached compiler stdout:
 
Cached compiler stderr:
 
Using cached compile:
Cached command line:  arm64-apple-darwin20.0.0-clang++ /Users/jenkins/j/workspace/release/tarball/eb40a89f6a/build/conda/envs/lsst-scipipe-12.1.0/share/eups/EupsBuildDir/Darwin/gauss2d_fit-g199a45376c+f63862d77a/gauss2d_fit-g199a45376c+f63862d77a/build-release/meson-private/tmp97m52l4l/testfile.cpp -E -P -ftree-vectorize -fPIC -fstack-protector-strong -O2 -pipe -stdlib=libc++ -fvisibility-inlines-hidden -fmessage-length=0 -isystem /Users/jenkins/j/workspace/release/tarball/eb40a89f6a/build/conda/envs/lsst-scipipe-12.1.0/include -D_FORTIFY_SOURCE=2 -isystem /Users/jenkins/j/workspace/release/tarball/eb40a89f6a/build/conda/envs/lsst-scipipe-12.1.0/include -mmacosx-version-min=14-arm -mmacosx-version-min=11.0 -P -O0 -fpermissive -Werror=implicit-function-declaration 

Code:
 
        #ifdef __has_include
         #if !__has_include("version")
          #error "Header 'version' could not be found"
         #endif
        #else
         #include <version>
        #endif
Cached compiler stdout:
 

Cached compiler stderr:
 
Using cached compile:
Cached command line:  arm64-apple-darwin20.0.0-clang++ /Users/jenkins/j/workspace/release/tarball/eb40a89f6a/build/conda/envs/lsst-scipipe-12.1.0/share/eups/EupsBuildDir/Darwin/gauss2d_fit-g199a45376c+f63862d77a/gauss2d_fit-g199a45376c+f63862d77a/build-release/meson-private/tmpe42uxog4/testfile.cpp -o /Users/jenkins/j/workspace/release/tarball/eb40a89f6a/build/conda/envs/lsst-scipipe-12.1.0/share/eups/EupsBuildDir/Darwin/gauss2d_fit-g199a45376c+f63862d77a/gauss2d_fit-g199a45376c+f63862d77a/build-release/meson-private/tmpe42uxog4/output.obj -c -ftree-vectorize -fPIC -fstack-protector-strong -O2 -pipe -stdlib=libc++ -fvisibility-inlines-hidden -fmessage-length=0 -isystem /Users/jenkins/j/workspace/release/tarball/eb40a89f6a/build/conda/envs/lsst-scipipe-12.1.0/include -D_FORTIFY_SOURCE=2 -isystem /Users/jenkins/j/workspace/release/tarball/eb40a89f6a/build/conda/envs/lsst-scipipe-12.1.0/include -mmacosx-version-min=14-arm -mmacosx-version-min=11.0 -O0 -fpermissive -Werror=implicit-function-declaration -Werror=unknown-warning-option -Werror=unused-command-line-argument -Werror=ignored-optimization-argument 

Code:
 
        #include <version>
        int main(void) {
            /* If it's not defined as a macro, try to use as a symbol */
            #ifndef _LIBCPP_VERSION
                _LIBCPP_VERSION;
            #endif
            return 0;
        }
Cached compiler stdout:
 
Cached compiler stderr:
 
Using cached compile:
Cached command line:  arm64-apple-darwin20.0.0-clang++ /Users/jenkins/j/workspace/release/tarball/eb40a89f6a/build/conda/envs/lsst-scipipe-12.1.0/share/eups/EupsBuildDir/Darwin/gauss2d_fit-g199a45376c+f63862d77a/gauss2d_fit-g199a45376c+f63862d77a/build-release/meson-private/tmp97m52l4l/testfile.cpp -E -P -ftree-vectorize -fPIC -fstack-protector-strong -O2 -pipe -stdlib=libc++ -fvisibility-inlines-hidden -fmessage-length=0 -isystem /Users/jenkins/j/workspace/release/tarball/eb40a89f6a/build/conda/envs/lsst-scipipe-12.1.0/include -D_FORTIFY_SOURCE=2 -isystem /Users/jenkins/j/workspace/release/tarball/eb40a89f6a/build/conda/envs/lsst-scipipe-12.1.0/include -mmacosx-version-min=14-arm -mmacosx-version-min=11.0 -P -O0 -fpermissive -Werror=implicit-function-declaration 

Code:
 
        #ifdef __has_include
         #if !__has_include("version")
          #error "Header 'version' could not be found"
         #endif
        #else
         #include <version>
        #endif
Cached compiler stdout:
 

Cached compiler stderr:
 
Using cached compile:
Cached command line:  arm64-apple-darwin20.0.0-clang++ /Users/jenkins/j/workspace/release/tarball/eb40a89f6a/build/conda/envs/lsst-scipipe-12.1.0/share/eups/EupsBuildDir/Darwin/gauss2d_fit-g199a45376c+f63862d77a/gauss2d_fit-g199a45376c+f63862d77a/build-release/meson-private/tmpe42uxog4/testfile.cpp -o /Users/jenkins/j/workspace/release/tarball/eb40a89f6a/build/conda/envs/lsst-scipipe-12.1.0/share/eups/EupsBuildDir/Darwin/gauss2d_fit-g199a45376c+f63862d77a/gauss2d_fit-g199a45376c+f63862d77a/build-release/meson-private/tmpe42uxog4/output.obj -c -ftree-vectorize -fPIC -fstack-protector-strong -O2 -pipe -stdlib=libc++ -fvisibility-inlines-hidden -fmessage-length=0 -isystem /Users/jenkins/j/workspace/release/tarball/eb40a89f6a/build/conda/envs/lsst-scipipe-12.1.0/include -D_FORTIFY_SOURCE=2 -isystem /Users/jenkins/j/workspace/release/tarball/eb40a89f6a/build/conda/envs/lsst-scipipe-12.1.0/include -mmacosx-version-min=14-arm -mmacosx-version-min=11.0 -O0 -fpermissive -Werror=implicit-function-declaration -Werror=unknown-warning-option -Werror=unused-command-line-argument -Werror=ignored-optimization-argument 

Code:
 
        #include <version>
        int main(void) {
            /* If it's not defined as a macro, try to use as a symbol */
            #ifndef _LIBCPP_VERSION
                _LIBCPP_VERSION;
            #endif
            return 0;
        }
Cached compiler stdout:
 
Cached compiler stderr:
 
Using cached compile:
Cached command line:  arm64-apple-darwin20.0.0-clang++ /Users/jenkins/j/workspace/release/tarball/eb40a89f6a/build/conda/envs/lsst-scipipe-12.1.0/share/eups/EupsBuildDir/Darwin/gauss2d_fit-g199a45376c+f63862d77a/gauss2d_fit-g199a45376c+f63862d77a/build-release/meson-private/tmp97m52l4l/testfile.cpp -E -P -ftree-vectorize -fPIC -fstack-protector-strong -O2 -pipe -stdlib=libc++ -fvisibility-inlines-hidden -fmessage-length=0 -isystem /Users/jenkins/j/workspace/release/tarball/eb40a89f6a/build/conda/envs/lsst-scipipe-12.1.0/include -D_FORTIFY_SOURCE=2 -isystem /Users/jenkins/j/workspace/release/tarball/eb40a89f6a/build/conda/envs/lsst-scipipe-12.1.0/include -mmacosx-version-min=14-arm -mmacosx-version-min=11.0 -P -O0 -fpermissive -Werror=implicit-function-declaration 

Code:
 
        #ifdef __has_include
         #if !__has_include("version")
          #error "Header 'version' could not be found"
         #endif
        #else
         #include <version>
        #endif
Cached compiler stdout:
 

Cached compiler stderr:
 
Using cached compile:
Cached command line:  arm64-apple-darwin20.0.0-clang++ /Users/jenkins/j/workspace/release/tarball/eb40a89f6a/build/conda/envs/lsst-scipipe-12.1.0/share/eups/EupsBuildDir/Darwin/gauss2d_fit-g199a45376c+f63862d77a/gauss2d_fit-g199a45376c+f63862d77a/build-release/meson-private/tmpe42uxog4/testfile.cpp -o /Users/jenkins/j/workspace/release/tarball/eb40a89f6a/build/conda/envs/lsst-scipipe-12.1.0/share/eups/EupsBuildDir/Darwin/gauss2d_fit-g199a45376c+f63862d77a/gauss2d_fit-g199a45376c+f63862d77a/build-release/meson-private/tmpe42uxog4/output.obj -c -ftree-vectorize -fPIC -fstack-protector-strong -O2 -pipe -stdlib=libc++ -fvisibility-inlines-hidden -fmessage-length=0 -isystem /Users/jenkins/j/workspace/release/tarball/eb40a89f6a/build/conda/envs/lsst-scipipe-12.1.0/include -D_FORTIFY_SOURCE=2 -isystem /Users/jenkins/j/workspace/release/tarball/eb40a89f6a/build/conda/envs/lsst-scipipe-12.1.0/include -mmacosx-version-min=14-arm -mmacosx-version-min=11.0 -O0 -fpermissive -Werror=implicit-function-declaration -Werror=unknown-warning-option -Werror=unused-command-line-argument -Werror=ignored-optimization-argument 

Code:
 
        #include <version>
        int main(void) {
            /* If it's not defined as a macro, try to use as a symbol */
            #ifndef _LIBCPP_VERSION
                _LIBCPP_VERSION;
            #endif
            return 0;
        }
Cached compiler stdout:
 
Cached compiler stderr:
 
Using cached compile:
Cached command line:  arm64-apple-darwin20.0.0-clang++ /Users/jenkins/j/workspace/release/tarball/eb40a89f6a/build/conda/envs/lsst-scipipe-12.1.0/share/eups/EupsBuildDir/Darwin/gauss2d_fit-g199a45376c+f63862d77a/gauss2d_fit-g199a45376c+f63862d77a/build-release/meson-private/tmp97m52l4l/testfile.cpp -E -P -ftree-vectorize -fPIC -fstack-protector-strong -O2 -pipe -stdlib=libc++ -fvisibility-inlines-hidden -fmessage-length=0 -isystem /Users/jenkins/j/workspace/release/tarball/eb40a89f6a/build/conda/envs/lsst-scipipe-12.1.0/include -D_FORTIFY_SOURCE=2 -isystem /Users/jenkins/j/workspace/release/tarball/eb40a89f6a/build/conda/envs/lsst-scipipe-12.1.0/include -mmacosx-version-min=14-arm -mmacosx-version-min=11.0 -P -O0 -fpermissive -Werror=implicit-function-declaration 

Code:
 
        #ifdef __has_include
         #if !__has_include("version")
          #error "Header 'version' could not be found"
         #endif
        #else
         #include <version>
        #endif
Cached compiler stdout:
 

Cached compiler stderr:
 
Using cached compile:
Cached command line:  arm64-apple-darwin20.0.0-clang++ /Users/jenkins/j/workspace/release/tarball/eb40a89f6a/build/conda/envs/lsst-scipipe-12.1.0/share/eups/EupsBuildDir/Darwin/gauss2d_fit-g199a45376c+f63862d77a/gauss2d_fit-g199a45376c+f63862d77a/build-release/meson-private/tmpe42uxog4/testfile.cpp -o /Users/jenkins/j/workspace/release/tarball/eb40a89f6a/build/conda/envs/lsst-scipipe-12.1.0/share/eups/EupsBuildDir/Darwin/gauss2d_fit-g199a45376c+f63862d77a/gauss2d_fit-g199a45376c+f63862d77a/build-release/meson-private/tmpe42uxog4/output.obj -c -ftree-vectorize -fPIC -fstack-protector-strong -O2 -pipe -stdlib=libc++ -fvisibility-inlines-hidden -fmessage-length=0 -isystem /Users/jenkins/j/workspace/release/tarball/eb40a89f6a/build/conda/envs/lsst-scipipe-12.1.0/include -D_FORTIFY_SOURCE=2 -isystem /Users/jenkins/j/workspace/release/tarball/eb40a89f6a/build/conda/envs/lsst-scipipe-12.1.0/include -mmacosx-version-min=14-arm -mmacosx-version-min=11.0 -O0 -fpermissive -Werror=implicit-function-declaration -Werror=unknown-warning-option -Werror=unused-command-line-argument -Werror=ignored-optimization-argument 

Code:
 
        #include <version>
        int main(void) {
            /* If it's not defined as a macro, try to use as a symbol */
            #ifndef _LIBCPP_VERSION
                _LIBCPP_VERSION;
            #endif
            return 0;
        }
Cached compiler stdout:
 
Cached compiler stderr:
 
Using cached compile:
Cached command line:  arm64-apple-darwin20.0.0-clang++ /Users/jenkins/j/workspace/release/tarball/eb40a89f6a/build/conda/envs/lsst-scipipe-12.1.0/share/eups/EupsBuildDir/Darwin/gauss2d_fit-g199a45376c+f63862d77a/gauss2d_fit-g199a45376c+f63862d77a/build-release/meson-private/tmp97m52l4l/testfile.cpp -E -P -ftree-vectorize -fPIC -fstack-protector-strong -O2 -pipe -stdlib=libc++ -fvisibility-inlines-hidden -fmessage-length=0 -isystem /Users/jenkins/j/workspace/release/tarball/eb40a89f6a/build/conda/envs/lsst-scipipe-12.1.0/include -D_FORTIFY_SOURCE=2 -isystem /Users/jenkins/j/workspace/release/tarball/eb40a89f6a/build/conda/envs/lsst-scipipe-12.1.0/include -mmacosx-version-min=14-arm -mmacosx-version-min=11.0 -P -O0 -fpermissive -Werror=implicit-function-declaration 

Code:
 
        #ifdef __has_include
         #if !__has_include("version")
          #error "Header 'version' could not be found"
         #endif
        #else
         #include <version>
        #endif
Cached compiler stdout:
 

Cached compiler stderr:
 
Using cached compile:
Cached command line:  arm64-apple-darwin20.0.0-clang++ /Users/jenkins/j/workspace/release/tarball/eb40a89f6a/build/conda/envs/lsst-scipipe-12.1.0/share/eups/EupsBuildDir/Darwin/gauss2d_fit-g199a45376c+f63862d77a/gauss2d_fit-g199a45376c+f63862d77a/build-release/meson-private/tmpe42uxog4/testfile.cpp -o /Users/jenkins/j/workspace/release/tarball/eb40a89f6a/build/conda/envs/lsst-scipipe-12.1.0/share/eups/EupsBuildDir/Darwin/gauss2d_fit-g199a45376c+f63862d77a/gauss2d_fit-g199a45376c+f63862d77a/build-release/meson-private/tmpe42uxog4/output.obj -c -ftree-vectorize -fPIC -fstack-protector-strong -O2 -pipe -stdlib=libc++ -fvisibility-inlines-hidden -fmessage-length=0 -isystem /Users/jenkins/j/workspace/release/tarball/eb40a89f6a/build/conda/envs/lsst-scipipe-12.1.0/include -D_FORTIFY_SOURCE=2 -isystem /Users/jenkins/j/workspace/release/tarball/eb40a89f6a/build/conda/envs/lsst-scipipe-12.1.0/include -mmacosx-version-min=14-arm -mmacosx-version-min=11.0 -O0 -fpermissive -Werror=implicit-function-declaration -Werror=unknown-warning-option -Werror=unused-command-line-argument -Werror=ignored-optimization-argument 

Code:
 
        #include <version>
        int main(void) {
            /* If it's not defined as a macro, try to use as a symbol */
            #ifndef _LIBCPP_VERSION
                _LIBCPP_VERSION;
            #endif
            return 0;
        }
Cached compiler stdout:
 
Cached compiler stderr:
 
Using cached compile:
Cached command line:  arm64-apple-darwin20.0.0-clang++ /Users/jenkins/j/workspace/release/tarball/eb40a89f6a/build/conda/envs/lsst-scipipe-12.1.0/share/eups/EupsBuildDir/Darwin/gauss2d_fit-g199a45376c+f63862d77a/gauss2d_fit-g199a45376c+f63862d77a/build-release/meson-private/tmp97m52l4l/testfile.cpp -E -P -ftree-vectorize -fPIC -fstack-protector-strong -O2 -pipe -stdlib=libc++ -fvisibility-inlines-hidden -fmessage-length=0 -isystem /Users/jenkins/j/workspace/release/tarball/eb40a89f6a/build/conda/envs/lsst-scipipe-12.1.0/include -D_FORTIFY_SOURCE=2 -isystem /Users/jenkins/j/workspace/release/tarball/eb40a89f6a/build/conda/envs/lsst-scipipe-12.1.0/include -mmacosx-version-min=14-arm -mmacosx-version-min=11.0 -P -O0 -fpermissive -Werror=implicit-function-declaration 

Code:
 
        #ifdef __has_include
         #if !__has_include("version")
          #error "Header 'version' could not be found"
         #endif
        #else
         #include <version>
        #endif
Cached compiler stdout:
 

Cached compiler stderr:
 
Using cached compile:
Cached command line:  arm64-apple-darwin20.0.0-clang++ /Users/jenkins/j/workspace/release/tarball/eb40a89f6a/build/conda/envs/lsst-scipipe-12.1.0/share/eups/EupsBuildDir/Darwin/gauss2d_fit-g199a45376c+f63862d77a/gauss2d_fit-g199a45376c+f63862d77a/build-release/meson-private/tmpe42uxog4/testfile.cpp -o /Users/jenkins/j/workspace/release/tarball/eb40a89f6a/build/conda/envs/lsst-scipipe-12.1.0/share/eups/EupsBuildDir/Darwin/gauss2d_fit-g199a45376c+f63862d77a/gauss2d_fit-g199a45376c+f63862d77a/build-release/meson-private/tmpe42uxog4/output.obj -c -ftree-vectorize -fPIC -fstack-protector-strong -O2 -pipe -stdlib=libc++ -fvisibility-inlines-hidden -fmessage-length=0 -isystem /Users/jenkins/j/workspace/release/tarball/eb40a89f6a/build/conda/envs/lsst-scipipe-12.1.0/include -D_FORTIFY_SOURCE=2 -isystem /Users/jenkins/j/workspace/release/tarball/eb40a89f6a/build/conda/envs/lsst-scipipe-12.1.0/include -mmacosx-version-min=14-arm -mmacosx-version-min=11.0 -O0 -fpermissive -Werror=implicit-function-declaration -Werror=unknown-warning-option -Werror=unused-command-line-argument -Werror=ignored-optimization-argument 

Code:
 
        #include <version>
        int main(void) {
            /* If it's not defined as a macro, try to use as a symbol */
            #ifndef _LIBCPP_VERSION
                _LIBCPP_VERSION;
            #endif
            return 0;
        }
Cached compiler stdout:
 
Cached compiler stderr:
 
Using cached compile:
Cached command line:  arm64-apple-darwin20.0.0-clang++ /Users/jenkins/j/workspace/release/tarball/eb40a89f6a/build/conda/envs/lsst-scipipe-12.1.0/share/eups/EupsBuildDir/Darwin/gauss2d_fit-g199a45376c+f63862d77a/gauss2d_fit-g199a45376c+f63862d77a/build-release/meson-private/tmp97m52l4l/testfile.cpp -E -P -ftree-vectorize -fPIC -fstack-protector-strong -O2 -pipe -stdlib=libc++ -fvisibility-inlines-hidden -fmessage-length=0 -isystem /Users/jenkins/j/workspace/release/tarball/eb40a89f6a/build/conda/envs/lsst-scipipe-12.1.0/include -D_FORTIFY_SOURCE=2 -isystem /Users/jenkins/j/workspace/release/tarball/eb40a89f6a/build/conda/envs/lsst-scipipe-12.1.0/include -mmacosx-version-min=14-arm -mmacosx-version-min=11.0 -P -O0 -fpermissive -Werror=implicit-function-declaration 

Code:
 
        #ifdef __has_include
         #if !__has_include("version")
          #error "Header 'version' could not be found"
         #endif
        #else
         #include <version>
        #endif
Cached compiler stdout:
 

Cached compiler stderr:
 
Using cached compile:
Cached command line:  arm64-apple-darwin20.0.0-clang++ /Users/jenkins/j/workspace/release/tarball/eb40a89f6a/build/conda/envs/lsst-scipipe-12.1.0/share/eups/EupsBuildDir/Darwin/gauss2d_fit-g199a45376c+f63862d77a/gauss2d_fit-g199a45376c+f63862d77a/build-release/meson-private/tmpe42uxog4/testfile.cpp -o /Users/jenkins/j/workspace/release/tarball/eb40a89f6a/build/conda/envs/lsst-scipipe-12.1.0/share/eups/EupsBuildDir/Darwin/gauss2d_fit-g199a45376c+f63862d77a/gauss2d_fit-g199a45376c+f63862d77a/build-release/meson-private/tmpe42uxog4/output.obj -c -ftree-vectorize -fPIC -fstack-protector-strong -O2 -pipe -stdlib=libc++ -fvisibility-inlines-hidden -fmessage-length=0 -isystem /Users/jenkins/j/workspace/release/tarball/eb40a89f6a/build/conda/envs/lsst-scipipe-12.1.0/include -D_FORTIFY_SOURCE=2 -isystem /Users/jenkins/j/workspace/release/tarball/eb40a89f6a/build/conda/envs/lsst-scipipe-12.1.0/include -mmacosx-version-min=14-arm -mmacosx-version-min=11.0 -O0 -fpermissive -Werror=implicit-function-declaration -Werror=unknown-warning-option -Werror=unused-command-line-argument -Werror=ignored-optimization-argument 

Code:
 
        #include <version>
        int main(void) {
            /* If it's not defined as a macro, try to use as a symbol */
            #ifndef _LIBCPP_VERSION
                _LIBCPP_VERSION;
            #endif
            return 0;
        }
Cached compiler stdout:
 
Cached compiler stderr:
 
Using cached compile:
Cached command line:  arm64-apple-darwin20.0.0-clang++ /Users/jenkins/j/workspace/release/tarball/eb40a89f6a/build/conda/envs/lsst-scipipe-12.1.0/share/eups/EupsBuildDir/Darwin/gauss2d_fit-g199a45376c+f63862d77a/gauss2d_fit-g199a45376c+f63862d77a/build-release/meson-private/tmp97m52l4l/testfile.cpp -E -P -ftree-vectorize -fPIC -fstack-protector-strong -O2 -pipe -stdlib=libc++ -fvisibility-inlines-hidden -fmessage-length=0 -isystem /Users/jenkins/j/workspace/release/tarball/eb40a89f6a/build/conda/envs/lsst-scipipe-12.1.0/include -D_FORTIFY_SOURCE=2 -isystem /Users/jenkins/j/workspace/release/tarball/eb40a89f6a/build/conda/envs/lsst-scipipe-12.1.0/include -mmacosx-version-min=14-arm -mmacosx-version-min=11.0 -P -O0 -fpermissive -Werror=implicit-function-declaration 

Code:
 
        #ifdef __has_include
         #if !__has_include("version")
          #error "Header 'version' could not be found"
         #endif
        #else
         #include <version>
        #endif
Cached compiler stdout:
 

Cached compiler stderr:
 
Using cached compile:
Cached command line:  arm64-apple-darwin20.0.0-clang++ /Users/jenkins/j/workspace/release/tarball/eb40a89f6a/build/conda/envs/lsst-scipipe-12.1.0/share/eups/EupsBuildDir/Darwin/gauss2d_fit-g199a45376c+f63862d77a/gauss2d_fit-g199a45376c+f63862d77a/build-release/meson-private/tmpe42uxog4/testfile.cpp -o /Users/jenkins/j/workspace/release/tarball/eb40a89f6a/build/conda/envs/lsst-scipipe-12.1.0/share/eups/EupsBuildDir/Darwin/gauss2d_fit-g199a45376c+f63862d77a/gauss2d_fit-g199a45376c+f63862d77a/build-release/meson-private/tmpe42uxog4/output.obj -c -ftree-vectorize -fPIC -fstack-protector-strong -O2 -pipe -stdlib=libc++ -fvisibility-inlines-hidden -fmessage-length=0 -isystem /Users/jenkins/j/workspace/release/tarball/eb40a89f6a/build/conda/envs/lsst-scipipe-12.1.0/include -D_FORTIFY_SOURCE=2 -isystem /Users/jenkins/j/workspace/release/tarball/eb40a89f6a/build/conda/envs/lsst-scipipe-12.1.0/include -mmacosx-version-min=14-arm -mmacosx-version-min=11.0 -O0 -fpermissive -Werror=implicit-function-declaration -Werror=unknown-warning-option -Werror=unused-command-line-argument -Werror=ignored-optimization-argument 

Code:
 
        #include <version>
        int main(void) {
            /* If it's not defined as a macro, try to use as a symbol */
            #ifndef _LIBCPP_VERSION
                _LIBCPP_VERSION;
            #endif
            return 0;
        }
Cached compiler stdout:
 
Cached compiler stderr:
 
Using cached compile:
Cached command line:  arm64-apple-darwin20.0.0-clang++ /Users/jenkins/j/workspace/release/tarball/eb40a89f6a/build/conda/envs/lsst-scipipe-12.1.0/share/eups/EupsBuildDir/Darwin/gauss2d_fit-g199a45376c+f63862d77a/gauss2d_fit-g199a45376c+f63862d77a/build-release/meson-private/tmp97m52l4l/testfile.cpp -E -P -ftree-vectorize -fPIC -fstack-protector-strong -O2 -pipe -stdlib=libc++ -fvisibility-inlines-hidden -fmessage-length=0 -isystem /Users/jenkins/j/workspace/release/tarball/eb40a89f6a/build/conda/envs/lsst-scipipe-12.1.0/include -D_FORTIFY_SOURCE=2 -isystem /Users/jenkins/j/workspace/release/tarball/eb40a89f6a/build/conda/envs/lsst-scipipe-12.1.0/include -mmacosx-version-min=14-arm -mmacosx-version-min=11.0 -P -O0 -fpermissive -Werror=implicit-function-declaration 

Code:
 
        #ifdef __has_include
         #if !__has_include("version")
          #error "Header 'version' could not be found"
         #endif
        #else
         #include <version>
        #endif
Cached compiler stdout:
 

Cached compiler stderr:
 
Using cached compile:
Cached command line:  arm64-apple-darwin20.0.0-clang++ /Users/jenkins/j/workspace/release/tarball/eb40a89f6a/build/conda/envs/lsst-scipipe-12.1.0/share/eups/EupsBuildDir/Darwin/gauss2d_fit-g199a45376c+f63862d77a/gauss2d_fit-g199a45376c+f63862d77a/build-release/meson-private/tmpe42uxog4/testfile.cpp -o /Users/jenkins/j/workspace/release/tarball/eb40a89f6a/build/conda/envs/lsst-scipipe-12.1.0/share/eups/EupsBuildDir/Darwin/gauss2d_fit-g199a45376c+f63862d77a/gauss2d_fit-g199a45376c+f63862d77a/build-release/meson-private/tmpe42uxog4/output.obj -c -ftree-vectorize -fPIC -fstack-protector-strong -O2 -pipe -stdlib=libc++ -fvisibility-inlines-hidden -fmessage-length=0 -isystem /Users/jenkins/j/workspace/release/tarball/eb40a89f6a/build/conda/envs/lsst-scipipe-12.1.0/include -D_FORTIFY_SOURCE=2 -isystem /Users/jenkins/j/workspace/release/tarball/eb40a89f6a/build/conda/envs/lsst-scipipe-12.1.0/include -mmacosx-version-min=14-arm -mmacosx-version-min=11.0 -O0 -fpermissive -Werror=implicit-function-declaration -Werror=unknown-warning-option -Werror=unused-command-line-argument -Werror=ignored-optimization-argument 

Code:
 
        #include <version>
        int main(void) {
            /* If it's not defined as a macro, try to use as a symbol */
            #ifndef _LIBCPP_VERSION
                _LIBCPP_VERSION;
            #endif
            return 0;
        }
Cached compiler stdout:
 
Cached compiler stderr:
 
!meson_ci!/ci_include "/Users/jenkins/j/workspace/release/tarball/eb40a89f6a/build/conda/envs/lsst-scipipe-12.1.0/share/eups/EupsBuildDir/Darwin/gauss2d_fit-g199a45376c+f63862d77a/gauss2d_fit-g199a45376c+f63862d77a/build-release/build.ninja"
