Build started at 2026-01-22T01:40:08.358642
Main binary: /Users/jenkins/j/workspace/release/tarball/eb40a89f6a/build/conda/envs/lsst-scipipe-12.1.0/bin/python3.13
Build Options: -Dprefix=/Users/jenkins/j/workspace/release/tarball/eb40a89f6a/build/conda/envs/lsst-scipipe-12.1.0/share/eups/EupsBuildDir/Darwin/gauss2d_fit-g199a45376c+0658834863/gauss2d_fit-g199a45376c+0658834863/build-release -Dlibdir=lib -Dbuildtype=release
Python system: Darwin
The Meson build system
Version: 1.10.0
Source dir: /Users/jenkins/j/workspace/release/tarball/eb40a89f6a/build/conda/envs/lsst-scipipe-12.1.0/share/eups/EupsBuildDir/Darwin/gauss2d_fit-g199a45376c+0658834863/gauss2d_fit-g199a45376c+0658834863
Build dir: /Users/jenkins/j/workspace/release/tarball/eb40a89f6a/build/conda/envs/lsst-scipipe-12.1.0/share/eups/EupsBuildDir/Darwin/gauss2d_fit-g199a45376c+0658834863/gauss2d_fit-g199a45376c+0658834863/build-release
Build type: native build
Project name: libgauss2d_fit
Project version: 0.3.0
-----------
Detecting compiler via: `arm64-apple-darwin20.0.0-clang++ --version` -> 0
stdout:
clang version 19.1.7
Target: arm64-apple-darwin20.0.0
Thread model: posix
InstalledDir: /Users/jenkins/j/workspace/release/tarball/eb40a89f6a/build/conda/envs/lsst-scipipe-12.1.0/bin
-----------
Running command: -x c++ -E -dM -
-----
-----------
Detecting linker via: `arm64-apple-darwin20.0.0-clang++ -Wl,--version -Wl,-headerpad_max_install_names -Wl,-dead_strip_dylibs -Wl,-rpath,/Users/jenkins/j/workspace/release/tarball/eb40a89f6a/build/conda/envs/lsst-scipipe-12.1.0/lib -L/Users/jenkins/j/workspace/release/tarball/eb40a89f6a/build/conda/envs/lsst-scipipe-12.1.0/lib -ftree-vectorize -fPIC -fstack-protector-strong -O2 -pipe -stdlib=libc++ -fvisibility-inlines-hidden -fmessage-length=0 -isystem /Users/jenkins/j/workspace/release/tarball/eb40a89f6a/build/conda/envs/lsst-scipipe-12.1.0/include -D_FORTIFY_SOURCE=2 -isystem /Users/jenkins/j/workspace/release/tarball/eb40a89f6a/build/conda/envs/lsst-scipipe-12.1.0/include -mmacosx-version-min=14-arm -mmacosx-version-min=11.0` -> 1
stderr:
ld: unknown option: --version
arm64-apple-darwin20.0: error: linker command failed with exit code 1 (use -v to see invocation)
-----------
-----------
Detecting Apple linker via: `arm64-apple-darwin20.0.0-clang++ -Wl,-v -Wl,-headerpad_max_install_names -Wl,-dead_strip_dylibs -Wl,-rpath,/Users/jenkins/j/workspace/release/tarball/eb40a89f6a/build/conda/envs/lsst-scipipe-12.1.0/lib -L/Users/jenkins/j/workspace/release/tarball/eb40a89f6a/build/conda/envs/lsst-scipipe-12.1.0/lib -ftree-vectorize -fPIC -fstack-protector-strong -O2 -pipe -stdlib=libc++ -fvisibility-inlines-hidden -fmessage-length=0 -isystem /Users/jenkins/j/workspace/release/tarball/eb40a89f6a/build/conda/envs/lsst-scipipe-12.1.0/include -D_FORTIFY_SOURCE=2 -isystem /Users/jenkins/j/workspace/release/tarball/eb40a89f6a/build/conda/envs/lsst-scipipe-12.1.0/include -mmacosx-version-min=14-arm -mmacosx-version-min=11.0` -> 1
stderr:
@(#)PROGRAM:ld  PROJECT:ld64-956.6
BUILD 17:03:05 Dec 30 2025
configured to support archs: armv6 armv7 armv7s arm64 arm64e arm64_32 i386 x86_64 x86_64h armv6m armv7k armv7m armv7em riscv32 (tvOS)
Library search paths:
	/Users/jenkins/j/workspace/release/tarball/eb40a89f6a/build/conda/envs/lsst-scipipe-12.1.0/lib
	/Library/Developer/CommandLineTools/SDKs/MacOSX.sdk/usr/lib
Framework search paths:
	/Library/Developer/CommandLineTools/SDKs/MacOSX.sdk/System/Library/Frameworks/
Undefined symbols for architecture arm64:
  "_main", referenced from:
     implicit entry/start for main executable
ld: symbol(s) not found for architecture arm64
arm64-apple-darwin20.0: error: linker command failed with exit code 1 (use -v to see invocation)
-----------
Sanity testing C++ compiler: arm64-apple-darwin20.0.0-clang++
Is cross compiler: False.
Sanity check compiler command line: arm64-apple-darwin20.0.0-clang++ sanitycheckcpp.cc -o sanitycheckcpp.exe -ftree-vectorize -fPIC -fstack-protector-strong -O2 -pipe -stdlib=libc++ -fvisibility-inlines-hidden -fmessage-length=0 -isystem /Users/jenkins/j/workspace/release/tarball/eb40a89f6a/build/conda/envs/lsst-scipipe-12.1.0/include -D_FORTIFY_SOURCE=2 -isystem /Users/jenkins/j/workspace/release/tarball/eb40a89f6a/build/conda/envs/lsst-scipipe-12.1.0/include -mmacosx-version-min=14-arm -mmacosx-version-min=11.0 -Wl,-headerpad_max_install_names -Wl,-dead_strip_dylibs -Wl,-rpath,/Users/jenkins/j/workspace/release/tarball/eb40a89f6a/build/conda/envs/lsst-scipipe-12.1.0/lib -L/Users/jenkins/j/workspace/release/tarball/eb40a89f6a/build/conda/envs/lsst-scipipe-12.1.0/lib
Sanity check compile stdout:

-----
Sanity check compile stderr:

-----
Running test binary command:  /Users/jenkins/j/workspace/release/tarball/eb40a89f6a/build/conda/envs/lsst-scipipe-12.1.0/share/eups/EupsBuildDir/Darwin/gauss2d_fit-g199a45376c+0658834863/gauss2d_fit-g199a45376c+0658834863/build-release/meson-private/sanitycheckcpp.exe
-----------
Sanity check: `/Users/jenkins/j/workspace/release/tarball/eb40a89f6a/build/conda/envs/lsst-scipipe-12.1.0/share/eups/EupsBuildDir/Darwin/gauss2d_fit-g199a45376c+0658834863/gauss2d_fit-g199a45376c+0658834863/build-release/meson-private/sanitycheckcpp.exe` -> 0
C++ compiler for the host machine: arm64-apple-darwin20.0.0-clang++ (clang 19.1.7 "clang version 19.1.7")
C++ linker for the host machine: arm64-apple-darwin20.0.0-clang++ ld64 956.6
-----------
Detecting archiver via: `arm64-apple-darwin20.0.0-ar --version` -> 1
stderr:
usage:  ar -d [-TLsv] archive file ...
	ar -m [-TLsv] archive file ...
	ar -m [-abiTLsv] position archive file ...
	ar -p [-TLsv] archive [file ...]
	ar -q [-cTLsv] archive file ...
	ar -r [-cuTLsv] archive file ...
	ar -r [-abciuTLsv] position archive file ...
	ar -t [-TLsv] archive [file ...]
	ar -x [-ouTLsv] archive [file ...]
-----------
-----------
Detecting compiler via: `arm64-apple-darwin20.0.0-clang++ --version` -> 0
stdout:
clang version 19.1.7
Target: arm64-apple-darwin20.0.0
Thread model: posix
InstalledDir: /Users/jenkins/j/workspace/release/tarball/eb40a89f6a/build/conda/envs/lsst-scipipe-12.1.0/bin
-----------
Running command: -x c++ -E -dM -
-----
-----------
Detecting linker via: `arm64-apple-darwin20.0.0-clang++ -Wl,--version -Wl,-headerpad_max_install_names -Wl,-dead_strip_dylibs -Wl,-rpath,/Users/jenkins/j/workspace/release/tarball/eb40a89f6a/build/conda/envs/lsst-scipipe-12.1.0/lib -L/Users/jenkins/j/workspace/release/tarball/eb40a89f6a/build/conda/envs/lsst-scipipe-12.1.0/lib -ftree-vectorize -fPIC -fstack-protector-strong -O2 -pipe -stdlib=libc++ -fvisibility-inlines-hidden -fmessage-length=0 -isystem /Users/jenkins/j/workspace/release/tarball/eb40a89f6a/build/conda/envs/lsst-scipipe-12.1.0/include -D_FORTIFY_SOURCE=2 -isystem /Users/jenkins/j/workspace/release/tarball/eb40a89f6a/build/conda/envs/lsst-scipipe-12.1.0/include -mmacosx-version-min=14-arm -mmacosx-version-min=11.0` -> 1
stderr:
ld: unknown option: --version
arm64-apple-darwin20.0: error: linker command failed with exit code 1 (use -v to see invocation)
-----------
-----------
Detecting Apple linker via: `arm64-apple-darwin20.0.0-clang++ -Wl,-v -Wl,-headerpad_max_install_names -Wl,-dead_strip_dylibs -Wl,-rpath,/Users/jenkins/j/workspace/release/tarball/eb40a89f6a/build/conda/envs/lsst-scipipe-12.1.0/lib -L/Users/jenkins/j/workspace/release/tarball/eb40a89f6a/build/conda/envs/lsst-scipipe-12.1.0/lib -ftree-vectorize -fPIC -fstack-protector-strong -O2 -pipe -stdlib=libc++ -fvisibility-inlines-hidden -fmessage-length=0 -isystem /Users/jenkins/j/workspace/release/tarball/eb40a89f6a/build/conda/envs/lsst-scipipe-12.1.0/include -D_FORTIFY_SOURCE=2 -isystem /Users/jenkins/j/workspace/release/tarball/eb40a89f6a/build/conda/envs/lsst-scipipe-12.1.0/include -mmacosx-version-min=14-arm -mmacosx-version-min=11.0` -> 1
stderr:
@(#)PROGRAM:ld  PROJECT:ld64-956.6
BUILD 17:03:05 Dec 30 2025
configured to support archs: armv6 armv7 armv7s arm64 arm64e arm64_32 i386 x86_64 x86_64h armv6m armv7k armv7m armv7em riscv32 (tvOS)
Library search paths:
	/Users/jenkins/j/workspace/release/tarball/eb40a89f6a/build/conda/envs/lsst-scipipe-12.1.0/lib
	/Library/Developer/CommandLineTools/SDKs/MacOSX.sdk/usr/lib
Framework search paths:
	/Library/Developer/CommandLineTools/SDKs/MacOSX.sdk/System/Library/Frameworks/
Undefined symbols for architecture arm64:
  "_main", referenced from:
     implicit entry/start for main executable
ld: symbol(s) not found for architecture arm64
arm64-apple-darwin20.0: error: linker command failed with exit code 1 (use -v to see invocation)
-----------
Sanity testing C++ compiler: arm64-apple-darwin20.0.0-clang++
Is cross compiler: False.
Sanity check compiler command line: arm64-apple-darwin20.0.0-clang++ sanitycheckcpp.cc -o sanitycheckcpp.exe -ftree-vectorize -fPIC -fstack-protector-strong -O2 -pipe -stdlib=libc++ -fvisibility-inlines-hidden -fmessage-length=0 -isystem /Users/jenkins/j/workspace/release/tarball/eb40a89f6a/build/conda/envs/lsst-scipipe-12.1.0/include -D_FORTIFY_SOURCE=2 -isystem /Users/jenkins/j/workspace/release/tarball/eb40a89f6a/build/conda/envs/lsst-scipipe-12.1.0/include -mmacosx-version-min=14-arm -mmacosx-version-min=11.0 -Wl,-headerpad_max_install_names -Wl,-dead_strip_dylibs -Wl,-rpath,/Users/jenkins/j/workspace/release/tarball/eb40a89f6a/build/conda/envs/lsst-scipipe-12.1.0/lib -L/Users/jenkins/j/workspace/release/tarball/eb40a89f6a/build/conda/envs/lsst-scipipe-12.1.0/lib
Sanity check compile stdout:

-----
Sanity check compile stderr:

-----
Running test binary command:  /Users/jenkins/j/workspace/release/tarball/eb40a89f6a/build/conda/envs/lsst-scipipe-12.1.0/share/eups/EupsBuildDir/Darwin/gauss2d_fit-g199a45376c+0658834863/gauss2d_fit-g199a45376c+0658834863/build-release/meson-private/sanitycheckcpp.exe
-----------
Sanity check: `/Users/jenkins/j/workspace/release/tarball/eb40a89f6a/build/conda/envs/lsst-scipipe-12.1.0/share/eups/EupsBuildDir/Darwin/gauss2d_fit-g199a45376c+0658834863/gauss2d_fit-g199a45376c+0658834863/build-release/meson-private/sanitycheckcpp.exe` -> 0
C++ compiler for the build machine: arm64-apple-darwin20.0.0-clang++ (clang 19.1.7 "clang version 19.1.7")
C++ linker for the build machine: arm64-apple-darwin20.0.0-clang++ ld64 956.6
-----------
Detecting archiver via: `arm64-apple-darwin20.0.0-ar --version` -> 1
stderr:
usage:  ar -d [-TLsv] archive file ...
	ar -m [-TLsv] archive file ...
	ar -m [-abiTLsv] position archive file ...
	ar -p [-TLsv] archive [file ...]
	ar -q [-cTLsv] archive file ...
	ar -r [-cuTLsv] archive file ...
	ar -r [-abciuTLsv] position archive file ...
	ar -t [-TLsv] archive [file ...]
	ar -x [-ouTLsv] archive [file ...]
-----------
Build machine cpu family: aarch64
Build machine cpu: aarch64
Host machine cpu family: aarch64
Host machine cpu: aarch64
Target machine cpu family: aarch64
Target machine cpu: aarch64
Program eups found: YES (/Users/jenkins/j/workspace/release/tarball/eb40a89f6a/build/conda/envs/lsst-scipipe-12.1.0/eups/bin/eups)
Running command: /Users/jenkins/j/workspace/release/tarball/eb40a89f6a/build/conda/envs/lsst-scipipe-12.1.0/eups/bin/eups list gauss2d_fit
--- stdout ---
   LOCAL:/Users/jenkins/j/workspace/release/tarball/eb40a89f6a/build/conda/envs/lsst-scipipe-12.1.0/share/eups/EupsBuildDir/Darwin/gauss2d_fit-g199a45376c+0658834863/gauss2d_fit-g199a45376c+0658834863 	setup
   g199a45376c+5137f08352 	d_2026_01_09 d_2026_01_10 v30_0_0_rc2 d_2025_12_19 d_2026_01_12 d_2025_12_24 w_2025_51 d_latest current w_2025_48 w_2026_02 d_2025_12_20 d_2026_01_16 d_2025_12_22 d_2026_01_14 d_2026_01_13 v30_0_0_rc1 d_2025_12_27 d_2026_01_11 v30_0_0_rc3 w_latest d_2025_12_23 w_2026_01 w_2025_52 o_latest w_2025_50 d_2026_01_17 d_2025_12_21 w_2026_03 w_2025_49 d_2026_01_02 d_2026_01_19 w_2025_47 d_2026_01_20 d_2026_01_04 d_2026_01_06 d_2025_12_30 d_2025_12_29 w_2025_46 d_2026_01_18 d_2026_01_03 v30_0_0 d_2025_12_31 d_2026_01_07 d_2025_12_28 d_2026_01_21 d_2026_01_05

--- stderr ---


Pkg-config binary missing from cross or native file, or env var undefined.
Trying a default Pkg-config fallback at pkg-config
Found pkg-config: YES (/Users/jenkins/j/workspace/release/tarball/eb40a89f6a/build/conda/envs/lsst-scipipe-12.1.0/bin/pkg-config) 0.29.2
Determining dependency 'gsl' with pkg-config executable '/Users/jenkins/j/workspace/release/tarball/eb40a89f6a/build/conda/envs/lsst-scipipe-12.1.0/bin/pkg-config'
env[PKG_CONFIG_PATH_AARCH64_APPLE_DARWIN]: /Users/jenkins/j/workspace/release/tarball/eb40a89f6a/build/conda/envs/lsst-scipipe-12.1.0/lib/pkgconfig
env[PKG_CONFIG_PATH]: 
env[PKG_CONFIG]: /Users/jenkins/j/workspace/release/tarball/eb40a89f6a/build/conda/envs/lsst-scipipe-12.1.0/bin/pkg-config
-----------
Called: `/Users/jenkins/j/workspace/release/tarball/eb40a89f6a/build/conda/envs/lsst-scipipe-12.1.0/bin/pkg-config --modversion gsl` -> 0
stdout:
2.7
-----------
env[PKG_CONFIG_PATH_AARCH64_APPLE_DARWIN]: /Users/jenkins/j/workspace/release/tarball/eb40a89f6a/build/conda/envs/lsst-scipipe-12.1.0/lib/pkgconfig
env[PKG_CONFIG_PATH]: 
env[PKG_CONFIG]: /Users/jenkins/j/workspace/release/tarball/eb40a89f6a/build/conda/envs/lsst-scipipe-12.1.0/bin/pkg-config
-----------
Called: `/Users/jenkins/j/workspace/release/tarball/eb40a89f6a/build/conda/envs/lsst-scipipe-12.1.0/bin/pkg-config --cflags gsl` -> 0
stdout:
-I/Users/jenkins/j/workspace/release/tarball/eb40a89f6a/build/conda/envs/lsst-scipipe-12.1.0/include
-----------
env[PKG_CONFIG_PATH_AARCH64_APPLE_DARWIN]: /Users/jenkins/j/workspace/release/tarball/eb40a89f6a/build/conda/envs/lsst-scipipe-12.1.0/lib/pkgconfig
env[PKG_CONFIG_ALLOW_SYSTEM_LIBS]: 1
env[PKG_CONFIG_PATH]: 
env[PKG_CONFIG]: /Users/jenkins/j/workspace/release/tarball/eb40a89f6a/build/conda/envs/lsst-scipipe-12.1.0/bin/pkg-config
-----------
Called: `/Users/jenkins/j/workspace/release/tarball/eb40a89f6a/build/conda/envs/lsst-scipipe-12.1.0/bin/pkg-config --libs gsl` -> 0
stdout:
-L/Users/jenkins/j/workspace/release/tarball/eb40a89f6a/build/conda/envs/lsst-scipipe-12.1.0/lib -lgsl -lgslcblas -lcblas -lm
-----------
env[PKG_CONFIG_PATH_AARCH64_APPLE_DARWIN]: /Users/jenkins/j/workspace/release/tarball/eb40a89f6a/build/conda/envs/lsst-scipipe-12.1.0/lib/pkgconfig
env[PKG_CONFIG_PATH]: 
env[PKG_CONFIG]: /Users/jenkins/j/workspace/release/tarball/eb40a89f6a/build/conda/envs/lsst-scipipe-12.1.0/bin/pkg-config
-----------
Called: `/Users/jenkins/j/workspace/release/tarball/eb40a89f6a/build/conda/envs/lsst-scipipe-12.1.0/bin/pkg-config --libs gsl` -> 0
stdout:
-L/Users/jenkins/j/workspace/release/tarball/eb40a89f6a/build/conda/envs/lsst-scipipe-12.1.0/lib -lgsl -lgslcblas -lcblas -lm
-----------
Running compile:
Working directory:  /Users/jenkins/j/workspace/release/tarball/eb40a89f6a/build/conda/envs/lsst-scipipe-12.1.0/share/eups/EupsBuildDir/Darwin/gauss2d_fit-g199a45376c+0658834863/gauss2d_fit-g199a45376c+0658834863/build-release/meson-private/tmpr3jcn363
Code:

        #include<stddef.h>
        #include<stdio.h>
        int main(void) {
            printf("%ld\n", (long)(sizeof(void *)));
            return 0;
        }
-----------
Command line: `arm64-apple-darwin20.0.0-clang++ -L/Users/jenkins/j/workspace/release/tarball/eb40a89f6a/build/conda/envs/lsst-scipipe-12.1.0/lib /Users/jenkins/j/workspace/release/tarball/eb40a89f6a/build/conda/envs/lsst-scipipe-12.1.0/share/eups/EupsBuildDir/Darwin/gauss2d_fit-g199a45376c+0658834863/gauss2d_fit-g199a45376c+0658834863/build-release/meson-private/tmpr3jcn363/testfile.cpp -o /Users/jenkins/j/workspace/release/tarball/eb40a89f6a/build/conda/envs/lsst-scipipe-12.1.0/share/eups/EupsBuildDir/Darwin/gauss2d_fit-g199a45376c+0658834863/gauss2d_fit-g199a45376c+0658834863/build-release/meson-private/tmpr3jcn363/output.exe -ftree-vectorize -fPIC -fstack-protector-strong -O2 -pipe -stdlib=libc++ -fvisibility-inlines-hidden -fmessage-length=0 -isystem /Users/jenkins/j/workspace/release/tarball/eb40a89f6a/build/conda/envs/lsst-scipipe-12.1.0/include -D_FORTIFY_SOURCE=2 -isystem /Users/jenkins/j/workspace/release/tarball/eb40a89f6a/build/conda/envs/lsst-scipipe-12.1.0/include -mmacosx-version-min=14-arm -mmacosx-version-min=11.0 -O0 -fpermissive -Werror=implicit-function-declaration -Wl,-headerpad_max_install_names -Wl,-dead_strip_dylibs -Wl,-rpath,/Users/jenkins/j/workspace/release/tarball/eb40a89f6a/build/conda/envs/lsst-scipipe-12.1.0/lib` -> 0
Program stdout:

8

Program stderr:


Running compile:
Working directory:  /Users/jenkins/j/workspace/release/tarball/eb40a89f6a/build/conda/envs/lsst-scipipe-12.1.0/share/eups/EupsBuildDir/Darwin/gauss2d_fit-g199a45376c+0658834863/gauss2d_fit-g199a45376c+0658834863/build-release/meson-private/tmpye_6ic_c
Code:

-----------
Command line: `arm64-apple-darwin20.0.0-clang++ /Users/jenkins/j/workspace/release/tarball/eb40a89f6a/build/conda/envs/lsst-scipipe-12.1.0/share/eups/EupsBuildDir/Darwin/gauss2d_fit-g199a45376c+0658834863/gauss2d_fit-g199a45376c+0658834863/build-release/meson-private/tmpye_6ic_c/testfile.cpp -o /Users/jenkins/j/workspace/release/tarball/eb40a89f6a/build/conda/envs/lsst-scipipe-12.1.0/share/eups/EupsBuildDir/Darwin/gauss2d_fit-g199a45376c+0658834863/gauss2d_fit-g199a45376c+0658834863/build-release/meson-private/tmpye_6ic_c/output.obj -c -ftree-vectorize -fPIC -fstack-protector-strong -O2 -pipe -stdlib=libc++ -fvisibility-inlines-hidden -fmessage-length=0 -isystem /Users/jenkins/j/workspace/release/tarball/eb40a89f6a/build/conda/envs/lsst-scipipe-12.1.0/include -D_FORTIFY_SOURCE=2 -isystem /Users/jenkins/j/workspace/release/tarball/eb40a89f6a/build/conda/envs/lsst-scipipe-12.1.0/include -mmacosx-version-min=14-arm -mmacosx-version-min=11.0 -O0 -fpermissive -Werror=implicit-function-declaration -Werror=unknown-warning-option -Werror=unused-command-line-argument -Werror=ignored-optimization-argument --print-search-dirs` -> 0
stdout:
programs: =/Users/jenkins/j/workspace/release/tarball/eb40a89f6a/build/conda/envs/lsst-scipipe-12.1.0/bin
libraries: =/Users/jenkins/j/workspace/release/tarball/eb40a89f6a/build/conda/envs/lsst-scipipe-12.1.0/lib/clang/19
-----------
Running compile:
Working directory:  /Users/jenkins/j/workspace/release/tarball/eb40a89f6a/build/conda/envs/lsst-scipipe-12.1.0/share/eups/EupsBuildDir/Darwin/gauss2d_fit-g199a45376c+0658834863/gauss2d_fit-g199a45376c+0658834863/build-release/meson-private/tmpp0kawd7v
Code:
int main(void) { return 0; }

-----------
Command line: `arm64-apple-darwin20.0.0-clang++ -L/Users/jenkins/j/workspace/release/tarball/eb40a89f6a/build/conda/envs/lsst-scipipe-12.1.0/lib /Users/jenkins/j/workspace/release/tarball/eb40a89f6a/build/conda/envs/lsst-scipipe-12.1.0/share/eups/EupsBuildDir/Darwin/gauss2d_fit-g199a45376c+0658834863/gauss2d_fit-g199a45376c+0658834863/build-release/meson-private/tmpp0kawd7v/testfile.cpp -o /Users/jenkins/j/workspace/release/tarball/eb40a89f6a/build/conda/envs/lsst-scipipe-12.1.0/share/eups/EupsBuildDir/Darwin/gauss2d_fit-g199a45376c+0658834863/gauss2d_fit-g199a45376c+0658834863/build-release/meson-private/tmpp0kawd7v/output.exe -ftree-vectorize -fPIC -fstack-protector-strong -O2 -pipe -stdlib=libc++ -fvisibility-inlines-hidden -fmessage-length=0 -isystem /Users/jenkins/j/workspace/release/tarball/eb40a89f6a/build/conda/envs/lsst-scipipe-12.1.0/include -D_FORTIFY_SOURCE=2 -isystem /Users/jenkins/j/workspace/release/tarball/eb40a89f6a/build/conda/envs/lsst-scipipe-12.1.0/include -mmacosx-version-min=14-arm -mmacosx-version-min=11.0 -O0 -fpermissive -Werror=implicit-function-declaration /Users/jenkins/j/workspace/release/tarball/eb40a89f6a/build/conda/envs/lsst-scipipe-12.1.0/lib/libgsl.dylib -Wl,-undefined,dynamic_lookup -Wl,-headerpad_max_install_names -Wl,-dead_strip_dylibs -Wl,-rpath,/Users/jenkins/j/workspace/release/tarball/eb40a89f6a/build/conda/envs/lsst-scipipe-12.1.0/lib` -> 0
Running compile:
Working directory:  /Users/jenkins/j/workspace/release/tarball/eb40a89f6a/build/conda/envs/lsst-scipipe-12.1.0/share/eups/EupsBuildDir/Darwin/gauss2d_fit-g199a45376c+0658834863/gauss2d_fit-g199a45376c+0658834863/build-release/meson-private/tmpozjux_rv
Code:
int main(void) { return 0; }

-----------
Command line: `arm64-apple-darwin20.0.0-clang++ -L/Users/jenkins/j/workspace/release/tarball/eb40a89f6a/build/conda/envs/lsst-scipipe-12.1.0/lib /Users/jenkins/j/workspace/release/tarball/eb40a89f6a/build/conda/envs/lsst-scipipe-12.1.0/share/eups/EupsBuildDir/Darwin/gauss2d_fit-g199a45376c+0658834863/gauss2d_fit-g199a45376c+0658834863/build-release/meson-private/tmpozjux_rv/testfile.cpp -o /Users/jenkins/j/workspace/release/tarball/eb40a89f6a/build/conda/envs/lsst-scipipe-12.1.0/share/eups/EupsBuildDir/Darwin/gauss2d_fit-g199a45376c+0658834863/gauss2d_fit-g199a45376c+0658834863/build-release/meson-private/tmpozjux_rv/output.exe -ftree-vectorize -fPIC -fstack-protector-strong -O2 -pipe -stdlib=libc++ -fvisibility-inlines-hidden -fmessage-length=0 -isystem /Users/jenkins/j/workspace/release/tarball/eb40a89f6a/build/conda/envs/lsst-scipipe-12.1.0/include -D_FORTIFY_SOURCE=2 -isystem /Users/jenkins/j/workspace/release/tarball/eb40a89f6a/build/conda/envs/lsst-scipipe-12.1.0/include -mmacosx-version-min=14-arm -mmacosx-version-min=11.0 -O0 -fpermissive -Werror=implicit-function-declaration /Users/jenkins/j/workspace/release/tarball/eb40a89f6a/build/conda/envs/lsst-scipipe-12.1.0/lib/libgslcblas.dylib -Wl,-undefined,dynamic_lookup -Wl,-headerpad_max_install_names -Wl,-dead_strip_dylibs -Wl,-rpath,/Users/jenkins/j/workspace/release/tarball/eb40a89f6a/build/conda/envs/lsst-scipipe-12.1.0/lib` -> 0
Running compile:
Working directory:  /Users/jenkins/j/workspace/release/tarball/eb40a89f6a/build/conda/envs/lsst-scipipe-12.1.0/share/eups/EupsBuildDir/Darwin/gauss2d_fit-g199a45376c+0658834863/gauss2d_fit-g199a45376c+0658834863/build-release/meson-private/tmpyts_ryfy
Code:
int main(void) { return 0; }

-----------
Command line: `arm64-apple-darwin20.0.0-clang++ -L/Users/jenkins/j/workspace/release/tarball/eb40a89f6a/build/conda/envs/lsst-scipipe-12.1.0/lib /Users/jenkins/j/workspace/release/tarball/eb40a89f6a/build/conda/envs/lsst-scipipe-12.1.0/share/eups/EupsBuildDir/Darwin/gauss2d_fit-g199a45376c+0658834863/gauss2d_fit-g199a45376c+0658834863/build-release/meson-private/tmpyts_ryfy/testfile.cpp -o /Users/jenkins/j/workspace/release/tarball/eb40a89f6a/build/conda/envs/lsst-scipipe-12.1.0/share/eups/EupsBuildDir/Darwin/gauss2d_fit-g199a45376c+0658834863/gauss2d_fit-g199a45376c+0658834863/build-release/meson-private/tmpyts_ryfy/output.exe -ftree-vectorize -fPIC -fstack-protector-strong -O2 -pipe -stdlib=libc++ -fvisibility-inlines-hidden -fmessage-length=0 -isystem /Users/jenkins/j/workspace/release/tarball/eb40a89f6a/build/conda/envs/lsst-scipipe-12.1.0/include -D_FORTIFY_SOURCE=2 -isystem /Users/jenkins/j/workspace/release/tarball/eb40a89f6a/build/conda/envs/lsst-scipipe-12.1.0/include -mmacosx-version-min=14-arm -mmacosx-version-min=11.0 -O0 -fpermissive -Werror=implicit-function-declaration /Users/jenkins/j/workspace/release/tarball/eb40a89f6a/build/conda/envs/lsst-scipipe-12.1.0/lib/libcblas.dylib -Wl,-undefined,dynamic_lookup -Wl,-headerpad_max_install_names -Wl,-dead_strip_dylibs -Wl,-rpath,/Users/jenkins/j/workspace/release/tarball/eb40a89f6a/build/conda/envs/lsst-scipipe-12.1.0/lib` -> 0
Running compile:
Working directory:  /Users/jenkins/j/workspace/release/tarball/eb40a89f6a/build/conda/envs/lsst-scipipe-12.1.0/share/eups/EupsBuildDir/Darwin/gauss2d_fit-g199a45376c+0658834863/gauss2d_fit-g199a45376c+0658834863/build-release/meson-private/tmptmwdwcfk
Code:
int main(void) { return 0; }

-----------
Command line: `arm64-apple-darwin20.0.0-clang++ -L/Users/jenkins/j/workspace/release/tarball/eb40a89f6a/build/conda/envs/lsst-scipipe-12.1.0/lib /Users/jenkins/j/workspace/release/tarball/eb40a89f6a/build/conda/envs/lsst-scipipe-12.1.0/share/eups/EupsBuildDir/Darwin/gauss2d_fit-g199a45376c+0658834863/gauss2d_fit-g199a45376c+0658834863/build-release/meson-private/tmptmwdwcfk/testfile.cpp -o /Users/jenkins/j/workspace/release/tarball/eb40a89f6a/build/conda/envs/lsst-scipipe-12.1.0/share/eups/EupsBuildDir/Darwin/gauss2d_fit-g199a45376c+0658834863/gauss2d_fit-g199a45376c+0658834863/build-release/meson-private/tmptmwdwcfk/output.exe -ftree-vectorize -fPIC -fstack-protector-strong -O2 -pipe -stdlib=libc++ -fvisibility-inlines-hidden -fmessage-length=0 -isystem /Users/jenkins/j/workspace/release/tarball/eb40a89f6a/build/conda/envs/lsst-scipipe-12.1.0/include -D_FORTIFY_SOURCE=2 -isystem /Users/jenkins/j/workspace/release/tarball/eb40a89f6a/build/conda/envs/lsst-scipipe-12.1.0/include -mmacosx-version-min=14-arm -mmacosx-version-min=11.0 -O0 -fpermissive -Werror=implicit-function-declaration -lm -Wl,-undefined,dynamic_lookup -Wl,-headerpad_max_install_names -Wl,-dead_strip_dylibs -Wl,-rpath,/Users/jenkins/j/workspace/release/tarball/eb40a89f6a/build/conda/envs/lsst-scipipe-12.1.0/lib` -> 0
Run-time dependency gsl found: YES 2.7
Running command: /bin/sh -c 'echo $GAUSS2D_DIR'
--- stdout ---
/Users/jenkins/j/workspace/release/tarball/eb40a89f6a/build/conda/envs/lsst-scipipe-12.1.0/share/eups/Darwin/gauss2d/gbf99507273+fd685ce083

--- stderr ---


Running compile:
Working directory:  /Users/jenkins/j/workspace/release/tarball/eb40a89f6a/build/conda/envs/lsst-scipipe-12.1.0/share/eups/EupsBuildDir/Darwin/gauss2d_fit-g199a45376c+0658834863/gauss2d_fit-g199a45376c+0658834863/build-release/meson-private/tmp7pt9g5x3
Code:
int main(void) { return 0; }

-----------
Command line: `arm64-apple-darwin20.0.0-clang++ -L/Users/jenkins/j/workspace/release/tarball/eb40a89f6a/build/conda/envs/lsst-scipipe-12.1.0/lib /Users/jenkins/j/workspace/release/tarball/eb40a89f6a/build/conda/envs/lsst-scipipe-12.1.0/share/eups/EupsBuildDir/Darwin/gauss2d_fit-g199a45376c+0658834863/gauss2d_fit-g199a45376c+0658834863/build-release/meson-private/tmp7pt9g5x3/testfile.cpp -o /Users/jenkins/j/workspace/release/tarball/eb40a89f6a/build/conda/envs/lsst-scipipe-12.1.0/share/eups/EupsBuildDir/Darwin/gauss2d_fit-g199a45376c+0658834863/gauss2d_fit-g199a45376c+0658834863/build-release/meson-private/tmp7pt9g5x3/output.exe -ftree-vectorize -fPIC -fstack-protector-strong -O2 -pipe -stdlib=libc++ -fvisibility-inlines-hidden -fmessage-length=0 -isystem /Users/jenkins/j/workspace/release/tarball/eb40a89f6a/build/conda/envs/lsst-scipipe-12.1.0/include -D_FORTIFY_SOURCE=2 -isystem /Users/jenkins/j/workspace/release/tarball/eb40a89f6a/build/conda/envs/lsst-scipipe-12.1.0/include -mmacosx-version-min=14-arm -mmacosx-version-min=11.0 -O0 -fpermissive -Werror=implicit-function-declaration /Users/jenkins/j/workspace/release/tarball/eb40a89f6a/build/conda/envs/lsst-scipipe-12.1.0/share/eups/Darwin/gauss2d/gbf99507273+fd685ce083/build-release/lib/lsst/libgauss2d.dylib -Wl,-undefined,dynamic_lookup -Wl,-headerpad_max_install_names -Wl,-dead_strip_dylibs -Wl,-rpath,/Users/jenkins/j/workspace/release/tarball/eb40a89f6a/build/conda/envs/lsst-scipipe-12.1.0/lib` -> 0
Library gauss2d found: YES
Running command: /bin/sh -c 'echo $MODELFIT_PARAMETERS_DIR'
--- stdout ---
/Users/jenkins/j/workspace/release/tarball/eb40a89f6a/build/conda/envs/lsst-scipipe-12.1.0/share/eups/Darwin/modelfit_parameters/g35bb328faa+fd685ce083

--- stderr ---


Adding test "centroidparameters"
Adding test "channel"
Adding test "data"
Adding test "fractionalintegralmodel"
Adding test "gaussiancomponent"
Adding test "gaussianparametricellipse"
Adding test "gaussianprior"
Adding test "gslinterpolator"
Adding test "gslsersicmixinterpolator"
Adding test "linearintegralmodel"
Adding test "linearsersicmixinterpolator"
Adding test "model"
Adding test "observation"
Adding test "parametricgaussian1d"
Adding test "psfmodel"
Adding test "sersicmix"
Adding test "sersicmixcomponent"
Adding test "shapeprior"
Adding test "source"
Build targets in project: 20

libgauss2d_fit 0.3.0

  User defined options
    buildtype: release
    libdir   : lib
    prefix   : /Users/jenkins/j/workspace/release/tarball/eb40a89f6a/build/conda/envs/lsst-scipipe-12.1.0/share/eups/EupsBuildDir/Darwin/gauss2d_fit-g199a45376c+0658834863/gauss2d_fit-g199a45376c+0658834863/build-release

Found ninja-1.13.2 at /Users/jenkins/j/workspace/release/tarball/eb40a89f6a/build/conda/envs/lsst-scipipe-12.1.0/bin/ninja
Running compile:
Working directory:  /Users/jenkins/j/workspace/release/tarball/eb40a89f6a/build/conda/envs/lsst-scipipe-12.1.0/share/eups/EupsBuildDir/Darwin/gauss2d_fit-g199a45376c+0658834863/gauss2d_fit-g199a45376c+0658834863/build-release/meson-private/tmp5nwwh0eb
Code:

        #ifdef __has_include
         #if !__has_include("version")
          #error "Header 'version' could not be found"
         #endif
        #else
         #include <version>
        #endif
-----------
Command line: `arm64-apple-darwin20.0.0-clang++ /Users/jenkins/j/workspace/release/tarball/eb40a89f6a/build/conda/envs/lsst-scipipe-12.1.0/share/eups/EupsBuildDir/Darwin/gauss2d_fit-g199a45376c+0658834863/gauss2d_fit-g199a45376c+0658834863/build-release/meson-private/tmp5nwwh0eb/testfile.cpp -E -P -ftree-vectorize -fPIC -fstack-protector-strong -O2 -pipe -stdlib=libc++ -fvisibility-inlines-hidden -fmessage-length=0 -isystem /Users/jenkins/j/workspace/release/tarball/eb40a89f6a/build/conda/envs/lsst-scipipe-12.1.0/include -D_FORTIFY_SOURCE=2 -isystem /Users/jenkins/j/workspace/release/tarball/eb40a89f6a/build/conda/envs/lsst-scipipe-12.1.0/include -mmacosx-version-min=14-arm -mmacosx-version-min=11.0 -P -O0 -fpermissive -Werror=implicit-function-declaration` -> 0
Running compile:
Working directory:  /Users/jenkins/j/workspace/release/tarball/eb40a89f6a/build/conda/envs/lsst-scipipe-12.1.0/share/eups/EupsBuildDir/Darwin/gauss2d_fit-g199a45376c+0658834863/gauss2d_fit-g199a45376c+0658834863/build-release/meson-private/tmpns_s6l_k
Code:

        #include <version>
        int main(void) {
            /* If it's not defined as a macro, try to use as a symbol */
            #ifndef _LIBCPP_VERSION
                _LIBCPP_VERSION;
            #endif
            return 0;
        }
-----------
Command line: `arm64-apple-darwin20.0.0-clang++ /Users/jenkins/j/workspace/release/tarball/eb40a89f6a/build/conda/envs/lsst-scipipe-12.1.0/share/eups/EupsBuildDir/Darwin/gauss2d_fit-g199a45376c+0658834863/gauss2d_fit-g199a45376c+0658834863/build-release/meson-private/tmpns_s6l_k/testfile.cpp -o /Users/jenkins/j/workspace/release/tarball/eb40a89f6a/build/conda/envs/lsst-scipipe-12.1.0/share/eups/EupsBuildDir/Darwin/gauss2d_fit-g199a45376c+0658834863/gauss2d_fit-g199a45376c+0658834863/build-release/meson-private/tmpns_s6l_k/output.obj -c -ftree-vectorize -fPIC -fstack-protector-strong -O2 -pipe -stdlib=libc++ -fvisibility-inlines-hidden -fmessage-length=0 -isystem /Users/jenkins/j/workspace/release/tarball/eb40a89f6a/build/conda/envs/lsst-scipipe-12.1.0/include -D_FORTIFY_SOURCE=2 -isystem /Users/jenkins/j/workspace/release/tarball/eb40a89f6a/build/conda/envs/lsst-scipipe-12.1.0/include -mmacosx-version-min=14-arm -mmacosx-version-min=11.0 -O0 -fpermissive -Werror=implicit-function-declaration -Werror=unknown-warning-option -Werror=unused-command-line-argument -Werror=ignored-optimization-argument` -> 0
Running compile:
Working directory:  /var/folders/9x/708ytvk10xdg3t5rj3q17jdr0000gp/T/tmpaapiq8ty
Code:
int i = static_cast<int>(0);
-----------
Command line: `arm64-apple-darwin20.0.0-clang++ /var/folders/9x/708ytvk10xdg3t5rj3q17jdr0000gp/T/tmpaapiq8ty/testfile.cpp -o /var/folders/9x/708ytvk10xdg3t5rj3q17jdr0000gp/T/tmpaapiq8ty/output.obj -c -std=c++20` -> 0
Compiler accepts -std=c++20: YES
Using cached compile:
Cached command line:  arm64-apple-darwin20.0.0-clang++ /Users/jenkins/j/workspace/release/tarball/eb40a89f6a/build/conda/envs/lsst-scipipe-12.1.0/share/eups/EupsBuildDir/Darwin/gauss2d_fit-g199a45376c+0658834863/gauss2d_fit-g199a45376c+0658834863/build-release/meson-private/tmp5nwwh0eb/testfile.cpp -E -P -ftree-vectorize -fPIC -fstack-protector-strong -O2 -pipe -stdlib=libc++ -fvisibility-inlines-hidden -fmessage-length=0 -isystem /Users/jenkins/j/workspace/release/tarball/eb40a89f6a/build/conda/envs/lsst-scipipe-12.1.0/include -D_FORTIFY_SOURCE=2 -isystem /Users/jenkins/j/workspace/release/tarball/eb40a89f6a/build/conda/envs/lsst-scipipe-12.1.0/include -mmacosx-version-min=14-arm -mmacosx-version-min=11.0 -P -O0 -fpermissive -Werror=implicit-function-declaration 

Code:
 
        #ifdef __has_include
         #if !__has_include("version")
          #error "Header 'version' could not be found"
         #endif
        #else
         #include <version>
        #endif
Cached compiler stdout:
 

Cached compiler stderr:
 
Using cached compile:
Cached command line:  arm64-apple-darwin20.0.0-clang++ /Users/jenkins/j/workspace/release/tarball/eb40a89f6a/build/conda/envs/lsst-scipipe-12.1.0/share/eups/EupsBuildDir/Darwin/gauss2d_fit-g199a45376c+0658834863/gauss2d_fit-g199a45376c+0658834863/build-release/meson-private/tmpns_s6l_k/testfile.cpp -o /Users/jenkins/j/workspace/release/tarball/eb40a89f6a/build/conda/envs/lsst-scipipe-12.1.0/share/eups/EupsBuildDir/Darwin/gauss2d_fit-g199a45376c+0658834863/gauss2d_fit-g199a45376c+0658834863/build-release/meson-private/tmpns_s6l_k/output.obj -c -ftree-vectorize -fPIC -fstack-protector-strong -O2 -pipe -stdlib=libc++ -fvisibility-inlines-hidden -fmessage-length=0 -isystem /Users/jenkins/j/workspace/release/tarball/eb40a89f6a/build/conda/envs/lsst-scipipe-12.1.0/include -D_FORTIFY_SOURCE=2 -isystem /Users/jenkins/j/workspace/release/tarball/eb40a89f6a/build/conda/envs/lsst-scipipe-12.1.0/include -mmacosx-version-min=14-arm -mmacosx-version-min=11.0 -O0 -fpermissive -Werror=implicit-function-declaration -Werror=unknown-warning-option -Werror=unused-command-line-argument -Werror=ignored-optimization-argument 

Code:
 
        #include <version>
        int main(void) {
            /* If it's not defined as a macro, try to use as a symbol */
            #ifndef _LIBCPP_VERSION
                _LIBCPP_VERSION;
            #endif
            return 0;
        }
Cached compiler stdout:
 
Cached compiler stderr:
 
Using cached compile:
Cached command line:  arm64-apple-darwin20.0.0-clang++ /Users/jenkins/j/workspace/release/tarball/eb40a89f6a/build/conda/envs/lsst-scipipe-12.1.0/share/eups/EupsBuildDir/Darwin/gauss2d_fit-g199a45376c+0658834863/gauss2d_fit-g199a45376c+0658834863/build-release/meson-private/tmp5nwwh0eb/testfile.cpp -E -P -ftree-vectorize -fPIC -fstack-protector-strong -O2 -pipe -stdlib=libc++ -fvisibility-inlines-hidden -fmessage-length=0 -isystem /Users/jenkins/j/workspace/release/tarball/eb40a89f6a/build/conda/envs/lsst-scipipe-12.1.0/include -D_FORTIFY_SOURCE=2 -isystem /Users/jenkins/j/workspace/release/tarball/eb40a89f6a/build/conda/envs/lsst-scipipe-12.1.0/include -mmacosx-version-min=14-arm -mmacosx-version-min=11.0 -P -O0 -fpermissive -Werror=implicit-function-declaration 

Code:
 
        #ifdef __has_include
         #if !__has_include("version")
          #error "Header 'version' could not be found"
         #endif
        #else
         #include <version>
        #endif
Cached compiler stdout:
 

Cached compiler stderr:
 
Using cached compile:
Cached command line:  arm64-apple-darwin20.0.0-clang++ /Users/jenkins/j/workspace/release/tarball/eb40a89f6a/build/conda/envs/lsst-scipipe-12.1.0/share/eups/EupsBuildDir/Darwin/gauss2d_fit-g199a45376c+0658834863/gauss2d_fit-g199a45376c+0658834863/build-release/meson-private/tmpns_s6l_k/testfile.cpp -o /Users/jenkins/j/workspace/release/tarball/eb40a89f6a/build/conda/envs/lsst-scipipe-12.1.0/share/eups/EupsBuildDir/Darwin/gauss2d_fit-g199a45376c+0658834863/gauss2d_fit-g199a45376c+0658834863/build-release/meson-private/tmpns_s6l_k/output.obj -c -ftree-vectorize -fPIC -fstack-protector-strong -O2 -pipe -stdlib=libc++ -fvisibility-inlines-hidden -fmessage-length=0 -isystem /Users/jenkins/j/workspace/release/tarball/eb40a89f6a/build/conda/envs/lsst-scipipe-12.1.0/include -D_FORTIFY_SOURCE=2 -isystem /Users/jenkins/j/workspace/release/tarball/eb40a89f6a/build/conda/envs/lsst-scipipe-12.1.0/include -mmacosx-version-min=14-arm -mmacosx-version-min=11.0 -O0 -fpermissive -Werror=implicit-function-declaration -Werror=unknown-warning-option -Werror=unused-command-line-argument -Werror=ignored-optimization-argument 

Code:
 
        #include <version>
        int main(void) {
            /* If it's not defined as a macro, try to use as a symbol */
            #ifndef _LIBCPP_VERSION
                _LIBCPP_VERSION;
            #endif
            return 0;
        }
Cached compiler stdout:
 
Cached compiler stderr:
 
Using cached compile:
Cached command line:  arm64-apple-darwin20.0.0-clang++ /Users/jenkins/j/workspace/release/tarball/eb40a89f6a/build/conda/envs/lsst-scipipe-12.1.0/share/eups/EupsBuildDir/Darwin/gauss2d_fit-g199a45376c+0658834863/gauss2d_fit-g199a45376c+0658834863/build-release/meson-private/tmp5nwwh0eb/testfile.cpp -E -P -ftree-vectorize -fPIC -fstack-protector-strong -O2 -pipe -stdlib=libc++ -fvisibility-inlines-hidden -fmessage-length=0 -isystem /Users/jenkins/j/workspace/release/tarball/eb40a89f6a/build/conda/envs/lsst-scipipe-12.1.0/include -D_FORTIFY_SOURCE=2 -isystem /Users/jenkins/j/workspace/release/tarball/eb40a89f6a/build/conda/envs/lsst-scipipe-12.1.0/include -mmacosx-version-min=14-arm -mmacosx-version-min=11.0 -P -O0 -fpermissive -Werror=implicit-function-declaration 

Code:
 
        #ifdef __has_include
         #if !__has_include("version")
          #error "Header 'version' could not be found"
         #endif
        #else
         #include <version>
        #endif
Cached compiler stdout:
 

Cached compiler stderr:
 
Using cached compile:
Cached command line:  arm64-apple-darwin20.0.0-clang++ /Users/jenkins/j/workspace/release/tarball/eb40a89f6a/build/conda/envs/lsst-scipipe-12.1.0/share/eups/EupsBuildDir/Darwin/gauss2d_fit-g199a45376c+0658834863/gauss2d_fit-g199a45376c+0658834863/build-release/meson-private/tmpns_s6l_k/testfile.cpp -o /Users/jenkins/j/workspace/release/tarball/eb40a89f6a/build/conda/envs/lsst-scipipe-12.1.0/share/eups/EupsBuildDir/Darwin/gauss2d_fit-g199a45376c+0658834863/gauss2d_fit-g199a45376c+0658834863/build-release/meson-private/tmpns_s6l_k/output.obj -c -ftree-vectorize -fPIC -fstack-protector-strong -O2 -pipe -stdlib=libc++ -fvisibility-inlines-hidden -fmessage-length=0 -isystem /Users/jenkins/j/workspace/release/tarball/eb40a89f6a/build/conda/envs/lsst-scipipe-12.1.0/include -D_FORTIFY_SOURCE=2 -isystem /Users/jenkins/j/workspace/release/tarball/eb40a89f6a/build/conda/envs/lsst-scipipe-12.1.0/include -mmacosx-version-min=14-arm -mmacosx-version-min=11.0 -O0 -fpermissive -Werror=implicit-function-declaration -Werror=unknown-warning-option -Werror=unused-command-line-argument -Werror=ignored-optimization-argument 

Code:
 
        #include <version>
        int main(void) {
            /* If it's not defined as a macro, try to use as a symbol */
            #ifndef _LIBCPP_VERSION
                _LIBCPP_VERSION;
            #endif
            return 0;
        }
Cached compiler stdout:
 
Cached compiler stderr:
 
Using cached compile:
Cached command line:  arm64-apple-darwin20.0.0-clang++ /Users/jenkins/j/workspace/release/tarball/eb40a89f6a/build/conda/envs/lsst-scipipe-12.1.0/share/eups/EupsBuildDir/Darwin/gauss2d_fit-g199a45376c+0658834863/gauss2d_fit-g199a45376c+0658834863/build-release/meson-private/tmp5nwwh0eb/testfile.cpp -E -P -ftree-vectorize -fPIC -fstack-protector-strong -O2 -pipe -stdlib=libc++ -fvisibility-inlines-hidden -fmessage-length=0 -isystem /Users/jenkins/j/workspace/release/tarball/eb40a89f6a/build/conda/envs/lsst-scipipe-12.1.0/include -D_FORTIFY_SOURCE=2 -isystem /Users/jenkins/j/workspace/release/tarball/eb40a89f6a/build/conda/envs/lsst-scipipe-12.1.0/include -mmacosx-version-min=14-arm -mmacosx-version-min=11.0 -P -O0 -fpermissive -Werror=implicit-function-declaration 

Code:
 
        #ifdef __has_include
         #if !__has_include("version")
          #error "Header 'version' could not be found"
         #endif
        #else
         #include <version>
        #endif
Cached compiler stdout:
 

Cached compiler stderr:
 
Using cached compile:
Cached command line:  arm64-apple-darwin20.0.0-clang++ /Users/jenkins/j/workspace/release/tarball/eb40a89f6a/build/conda/envs/lsst-scipipe-12.1.0/share/eups/EupsBuildDir/Darwin/gauss2d_fit-g199a45376c+0658834863/gauss2d_fit-g199a45376c+0658834863/build-release/meson-private/tmpns_s6l_k/testfile.cpp -o /Users/jenkins/j/workspace/release/tarball/eb40a89f6a/build/conda/envs/lsst-scipipe-12.1.0/share/eups/EupsBuildDir/Darwin/gauss2d_fit-g199a45376c+0658834863/gauss2d_fit-g199a45376c+0658834863/build-release/meson-private/tmpns_s6l_k/output.obj -c -ftree-vectorize -fPIC -fstack-protector-strong -O2 -pipe -stdlib=libc++ -fvisibility-inlines-hidden -fmessage-length=0 -isystem /Users/jenkins/j/workspace/release/tarball/eb40a89f6a/build/conda/envs/lsst-scipipe-12.1.0/include -D_FORTIFY_SOURCE=2 -isystem /Users/jenkins/j/workspace/release/tarball/eb40a89f6a/build/conda/envs/lsst-scipipe-12.1.0/include -mmacosx-version-min=14-arm -mmacosx-version-min=11.0 -O0 -fpermissive -Werror=implicit-function-declaration -Werror=unknown-warning-option -Werror=unused-command-line-argument -Werror=ignored-optimization-argument 

Code:
 
        #include <version>
        int main(void) {
            /* If it's not defined as a macro, try to use as a symbol */
            #ifndef _LIBCPP_VERSION
                _LIBCPP_VERSION;
            #endif
            return 0;
        }
Cached compiler stdout:
 
Cached compiler stderr:
 
Using cached compile:
Cached command line:  arm64-apple-darwin20.0.0-clang++ /Users/jenkins/j/workspace/release/tarball/eb40a89f6a/build/conda/envs/lsst-scipipe-12.1.0/share/eups/EupsBuildDir/Darwin/gauss2d_fit-g199a45376c+0658834863/gauss2d_fit-g199a45376c+0658834863/build-release/meson-private/tmp5nwwh0eb/testfile.cpp -E -P -ftree-vectorize -fPIC -fstack-protector-strong -O2 -pipe -stdlib=libc++ -fvisibility-inlines-hidden -fmessage-length=0 -isystem /Users/jenkins/j/workspace/release/tarball/eb40a89f6a/build/conda/envs/lsst-scipipe-12.1.0/include -D_FORTIFY_SOURCE=2 -isystem /Users/jenkins/j/workspace/release/tarball/eb40a89f6a/build/conda/envs/lsst-scipipe-12.1.0/include -mmacosx-version-min=14-arm -mmacosx-version-min=11.0 -P -O0 -fpermissive -Werror=implicit-function-declaration 

Code:
 
        #ifdef __has_include
         #if !__has_include("version")
          #error "Header 'version' could not be found"
         #endif
        #else
         #include <version>
        #endif
Cached compiler stdout:
 

Cached compiler stderr:
 
Using cached compile:
Cached command line:  arm64-apple-darwin20.0.0-clang++ /Users/jenkins/j/workspace/release/tarball/eb40a89f6a/build/conda/envs/lsst-scipipe-12.1.0/share/eups/EupsBuildDir/Darwin/gauss2d_fit-g199a45376c+0658834863/gauss2d_fit-g199a45376c+0658834863/build-release/meson-private/tmpns_s6l_k/testfile.cpp -o /Users/jenkins/j/workspace/release/tarball/eb40a89f6a/build/conda/envs/lsst-scipipe-12.1.0/share/eups/EupsBuildDir/Darwin/gauss2d_fit-g199a45376c+0658834863/gauss2d_fit-g199a45376c+0658834863/build-release/meson-private/tmpns_s6l_k/output.obj -c -ftree-vectorize -fPIC -fstack-protector-strong -O2 -pipe -stdlib=libc++ -fvisibility-inlines-hidden -fmessage-length=0 -isystem /Users/jenkins/j/workspace/release/tarball/eb40a89f6a/build/conda/envs/lsst-scipipe-12.1.0/include -D_FORTIFY_SOURCE=2 -isystem /Users/jenkins/j/workspace/release/tarball/eb40a89f6a/build/conda/envs/lsst-scipipe-12.1.0/include -mmacosx-version-min=14-arm -mmacosx-version-min=11.0 -O0 -fpermissive -Werror=implicit-function-declaration -Werror=unknown-warning-option -Werror=unused-command-line-argument -Werror=ignored-optimization-argument 

Code:
 
        #include <version>
        int main(void) {
            /* If it's not defined as a macro, try to use as a symbol */
            #ifndef _LIBCPP_VERSION
                _LIBCPP_VERSION;
            #endif
            return 0;
        }
Cached compiler stdout:
 
Cached compiler stderr:
 
Using cached compile:
Cached command line:  arm64-apple-darwin20.0.0-clang++ /Users/jenkins/j/workspace/release/tarball/eb40a89f6a/build/conda/envs/lsst-scipipe-12.1.0/share/eups/EupsBuildDir/Darwin/gauss2d_fit-g199a45376c+0658834863/gauss2d_fit-g199a45376c+0658834863/build-release/meson-private/tmp5nwwh0eb/testfile.cpp -E -P -ftree-vectorize -fPIC -fstack-protector-strong -O2 -pipe -stdlib=libc++ -fvisibility-inlines-hidden -fmessage-length=0 -isystem /Users/jenkins/j/workspace/release/tarball/eb40a89f6a/build/conda/envs/lsst-scipipe-12.1.0/include -D_FORTIFY_SOURCE=2 -isystem /Users/jenkins/j/workspace/release/tarball/eb40a89f6a/build/conda/envs/lsst-scipipe-12.1.0/include -mmacosx-version-min=14-arm -mmacosx-version-min=11.0 -P -O0 -fpermissive -Werror=implicit-function-declaration 

Code:
 
        #ifdef __has_include
         #if !__has_include("version")
          #error "Header 'version' could not be found"
         #endif
        #else
         #include <version>
        #endif
Cached compiler stdout:
 

Cached compiler stderr:
 
Using cached compile:
Cached command line:  arm64-apple-darwin20.0.0-clang++ /Users/jenkins/j/workspace/release/tarball/eb40a89f6a/build/conda/envs/lsst-scipipe-12.1.0/share/eups/EupsBuildDir/Darwin/gauss2d_fit-g199a45376c+0658834863/gauss2d_fit-g199a45376c+0658834863/build-release/meson-private/tmpns_s6l_k/testfile.cpp -o /Users/jenkins/j/workspace/release/tarball/eb40a89f6a/build/conda/envs/lsst-scipipe-12.1.0/share/eups/EupsBuildDir/Darwin/gauss2d_fit-g199a45376c+0658834863/gauss2d_fit-g199a45376c+0658834863/build-release/meson-private/tmpns_s6l_k/output.obj -c -ftree-vectorize -fPIC -fstack-protector-strong -O2 -pipe -stdlib=libc++ -fvisibility-inlines-hidden -fmessage-length=0 -isystem /Users/jenkins/j/workspace/release/tarball/eb40a89f6a/build/conda/envs/lsst-scipipe-12.1.0/include -D_FORTIFY_SOURCE=2 -isystem /Users/jenkins/j/workspace/release/tarball/eb40a89f6a/build/conda/envs/lsst-scipipe-12.1.0/include -mmacosx-version-min=14-arm -mmacosx-version-min=11.0 -O0 -fpermissive -Werror=implicit-function-declaration -Werror=unknown-warning-option -Werror=unused-command-line-argument -Werror=ignored-optimization-argument 

Code:
 
        #include <version>
        int main(void) {
            /* If it's not defined as a macro, try to use as a symbol */
            #ifndef _LIBCPP_VERSION
                _LIBCPP_VERSION;
            #endif
            return 0;
        }
Cached compiler stdout:
 
Cached compiler stderr:
 
Using cached compile:
Cached command line:  arm64-apple-darwin20.0.0-clang++ /Users/jenkins/j/workspace/release/tarball/eb40a89f6a/build/conda/envs/lsst-scipipe-12.1.0/share/eups/EupsBuildDir/Darwin/gauss2d_fit-g199a45376c+0658834863/gauss2d_fit-g199a45376c+0658834863/build-release/meson-private/tmp5nwwh0eb/testfile.cpp -E -P -ftree-vectorize -fPIC -fstack-protector-strong -O2 -pipe -stdlib=libc++ -fvisibility-inlines-hidden -fmessage-length=0 -isystem /Users/jenkins/j/workspace/release/tarball/eb40a89f6a/build/conda/envs/lsst-scipipe-12.1.0/include -D_FORTIFY_SOURCE=2 -isystem /Users/jenkins/j/workspace/release/tarball/eb40a89f6a/build/conda/envs/lsst-scipipe-12.1.0/include -mmacosx-version-min=14-arm -mmacosx-version-min=11.0 -P -O0 -fpermissive -Werror=implicit-function-declaration 

Code:
 
        #ifdef __has_include
         #if !__has_include("version")
          #error "Header 'version' could not be found"
         #endif
        #else
         #include <version>
        #endif
Cached compiler stdout:
 

Cached compiler stderr:
 
Using cached compile:
Cached command line:  arm64-apple-darwin20.0.0-clang++ /Users/jenkins/j/workspace/release/tarball/eb40a89f6a/build/conda/envs/lsst-scipipe-12.1.0/share/eups/EupsBuildDir/Darwin/gauss2d_fit-g199a45376c+0658834863/gauss2d_fit-g199a45376c+0658834863/build-release/meson-private/tmpns_s6l_k/testfile.cpp -o /Users/jenkins/j/workspace/release/tarball/eb40a89f6a/build/conda/envs/lsst-scipipe-12.1.0/share/eups/EupsBuildDir/Darwin/gauss2d_fit-g199a45376c+0658834863/gauss2d_fit-g199a45376c+0658834863/build-release/meson-private/tmpns_s6l_k/output.obj -c -ftree-vectorize -fPIC -fstack-protector-strong -O2 -pipe -stdlib=libc++ -fvisibility-inlines-hidden -fmessage-length=0 -isystem /Users/jenkins/j/workspace/release/tarball/eb40a89f6a/build/conda/envs/lsst-scipipe-12.1.0/include -D_FORTIFY_SOURCE=2 -isystem /Users/jenkins/j/workspace/release/tarball/eb40a89f6a/build/conda/envs/lsst-scipipe-12.1.0/include -mmacosx-version-min=14-arm -mmacosx-version-min=11.0 -O0 -fpermissive -Werror=implicit-function-declaration -Werror=unknown-warning-option -Werror=unused-command-line-argument -Werror=ignored-optimization-argument 

Code:
 
        #include <version>
        int main(void) {
            /* If it's not defined as a macro, try to use as a symbol */
            #ifndef _LIBCPP_VERSION
                _LIBCPP_VERSION;
            #endif
            return 0;
        }
Cached compiler stdout:
 
Cached compiler stderr:
 
Using cached compile:
Cached command line:  arm64-apple-darwin20.0.0-clang++ /Users/jenkins/j/workspace/release/tarball/eb40a89f6a/build/conda/envs/lsst-scipipe-12.1.0/share/eups/EupsBuildDir/Darwin/gauss2d_fit-g199a45376c+0658834863/gauss2d_fit-g199a45376c+0658834863/build-release/meson-private/tmp5nwwh0eb/testfile.cpp -E -P -ftree-vectorize -fPIC -fstack-protector-strong -O2 -pipe -stdlib=libc++ -fvisibility-inlines-hidden -fmessage-length=0 -isystem /Users/jenkins/j/workspace/release/tarball/eb40a89f6a/build/conda/envs/lsst-scipipe-12.1.0/include -D_FORTIFY_SOURCE=2 -isystem /Users/jenkins/j/workspace/release/tarball/eb40a89f6a/build/conda/envs/lsst-scipipe-12.1.0/include -mmacosx-version-min=14-arm -mmacosx-version-min=11.0 -P -O0 -fpermissive -Werror=implicit-function-declaration 

Code:
 
        #ifdef __has_include
         #if !__has_include("version")
          #error "Header 'version' could not be found"
         #endif
        #else
         #include <version>
        #endif
Cached compiler stdout:
 

Cached compiler stderr:
 
Using cached compile:
Cached command line:  arm64-apple-darwin20.0.0-clang++ /Users/jenkins/j/workspace/release/tarball/eb40a89f6a/build/conda/envs/lsst-scipipe-12.1.0/share/eups/EupsBuildDir/Darwin/gauss2d_fit-g199a45376c+0658834863/gauss2d_fit-g199a45376c+0658834863/build-release/meson-private/tmpns_s6l_k/testfile.cpp -o /Users/jenkins/j/workspace/release/tarball/eb40a89f6a/build/conda/envs/lsst-scipipe-12.1.0/share/eups/EupsBuildDir/Darwin/gauss2d_fit-g199a45376c+0658834863/gauss2d_fit-g199a45376c+0658834863/build-release/meson-private/tmpns_s6l_k/output.obj -c -ftree-vectorize -fPIC -fstack-protector-strong -O2 -pipe -stdlib=libc++ -fvisibility-inlines-hidden -fmessage-length=0 -isystem /Users/jenkins/j/workspace/release/tarball/eb40a89f6a/build/conda/envs/lsst-scipipe-12.1.0/include -D_FORTIFY_SOURCE=2 -isystem /Users/jenkins/j/workspace/release/tarball/eb40a89f6a/build/conda/envs/lsst-scipipe-12.1.0/include -mmacosx-version-min=14-arm -mmacosx-version-min=11.0 -O0 -fpermissive -Werror=implicit-function-declaration -Werror=unknown-warning-option -Werror=unused-command-line-argument -Werror=ignored-optimization-argument 

Code:
 
        #include <version>
        int main(void) {
            /* If it's not defined as a macro, try to use as a symbol */
            #ifndef _LIBCPP_VERSION
                _LIBCPP_VERSION;
            #endif
            return 0;
        }
Cached compiler stdout:
 
Cached compiler stderr:
 
Using cached compile:
Cached command line:  arm64-apple-darwin20.0.0-clang++ /Users/jenkins/j/workspace/release/tarball/eb40a89f6a/build/conda/envs/lsst-scipipe-12.1.0/share/eups/EupsBuildDir/Darwin/gauss2d_fit-g199a45376c+0658834863/gauss2d_fit-g199a45376c+0658834863/build-release/meson-private/tmp5nwwh0eb/testfile.cpp -E -P -ftree-vectorize -fPIC -fstack-protector-strong -O2 -pipe -stdlib=libc++ -fvisibility-inlines-hidden -fmessage-length=0 -isystem /Users/jenkins/j/workspace/release/tarball/eb40a89f6a/build/conda/envs/lsst-scipipe-12.1.0/include -D_FORTIFY_SOURCE=2 -isystem /Users/jenkins/j/workspace/release/tarball/eb40a89f6a/build/conda/envs/lsst-scipipe-12.1.0/include -mmacosx-version-min=14-arm -mmacosx-version-min=11.0 -P -O0 -fpermissive -Werror=implicit-function-declaration 

Code:
 
        #ifdef __has_include
         #if !__has_include("version")
          #error "Header 'version' could not be found"
         #endif
        #else
         #include <version>
        #endif
Cached compiler stdout:
 

Cached compiler stderr:
 
Using cached compile:
Cached command line:  arm64-apple-darwin20.0.0-clang++ /Users/jenkins/j/workspace/release/tarball/eb40a89f6a/build/conda/envs/lsst-scipipe-12.1.0/share/eups/EupsBuildDir/Darwin/gauss2d_fit-g199a45376c+0658834863/gauss2d_fit-g199a45376c+0658834863/build-release/meson-private/tmpns_s6l_k/testfile.cpp -o /Users/jenkins/j/workspace/release/tarball/eb40a89f6a/build/conda/envs/lsst-scipipe-12.1.0/share/eups/EupsBuildDir/Darwin/gauss2d_fit-g199a45376c+0658834863/gauss2d_fit-g199a45376c+0658834863/build-release/meson-private/tmpns_s6l_k/output.obj -c -ftree-vectorize -fPIC -fstack-protector-strong -O2 -pipe -stdlib=libc++ -fvisibility-inlines-hidden -fmessage-length=0 -isystem /Users/jenkins/j/workspace/release/tarball/eb40a89f6a/build/conda/envs/lsst-scipipe-12.1.0/include -D_FORTIFY_SOURCE=2 -isystem /Users/jenkins/j/workspace/release/tarball/eb40a89f6a/build/conda/envs/lsst-scipipe-12.1.0/include -mmacosx-version-min=14-arm -mmacosx-version-min=11.0 -O0 -fpermissive -Werror=implicit-function-declaration -Werror=unknown-warning-option -Werror=unused-command-line-argument -Werror=ignored-optimization-argument 

Code:
 
        #include <version>
        int main(void) {
            /* If it's not defined as a macro, try to use as a symbol */
            #ifndef _LIBCPP_VERSION
                _LIBCPP_VERSION;
            #endif
            return 0;
        }
Cached compiler stdout:
 
Cached compiler stderr:
 
Using cached compile:
Cached command line:  arm64-apple-darwin20.0.0-clang++ /Users/jenkins/j/workspace/release/tarball/eb40a89f6a/build/conda/envs/lsst-scipipe-12.1.0/share/eups/EupsBuildDir/Darwin/gauss2d_fit-g199a45376c+0658834863/gauss2d_fit-g199a45376c+0658834863/build-release/meson-private/tmp5nwwh0eb/testfile.cpp -E -P -ftree-vectorize -fPIC -fstack-protector-strong -O2 -pipe -stdlib=libc++ -fvisibility-inlines-hidden -fmessage-length=0 -isystem /Users/jenkins/j/workspace/release/tarball/eb40a89f6a/build/conda/envs/lsst-scipipe-12.1.0/include -D_FORTIFY_SOURCE=2 -isystem /Users/jenkins/j/workspace/release/tarball/eb40a89f6a/build/conda/envs/lsst-scipipe-12.1.0/include -mmacosx-version-min=14-arm -mmacosx-version-min=11.0 -P -O0 -fpermissive -Werror=implicit-function-declaration 

Code:
 
        #ifdef __has_include
         #if !__has_include("version")
          #error "Header 'version' could not be found"
         #endif
        #else
         #include <version>
        #endif
Cached compiler stdout:
 

Cached compiler stderr:
 
Using cached compile:
Cached command line:  arm64-apple-darwin20.0.0-clang++ /Users/jenkins/j/workspace/release/tarball/eb40a89f6a/build/conda/envs/lsst-scipipe-12.1.0/share/eups/EupsBuildDir/Darwin/gauss2d_fit-g199a45376c+0658834863/gauss2d_fit-g199a45376c+0658834863/build-release/meson-private/tmpns_s6l_k/testfile.cpp -o /Users/jenkins/j/workspace/release/tarball/eb40a89f6a/build/conda/envs/lsst-scipipe-12.1.0/share/eups/EupsBuildDir/Darwin/gauss2d_fit-g199a45376c+0658834863/gauss2d_fit-g199a45376c+0658834863/build-release/meson-private/tmpns_s6l_k/output.obj -c -ftree-vectorize -fPIC -fstack-protector-strong -O2 -pipe -stdlib=libc++ -fvisibility-inlines-hidden -fmessage-length=0 -isystem /Users/jenkins/j/workspace/release/tarball/eb40a89f6a/build/conda/envs/lsst-scipipe-12.1.0/include -D_FORTIFY_SOURCE=2 -isystem /Users/jenkins/j/workspace/release/tarball/eb40a89f6a/build/conda/envs/lsst-scipipe-12.1.0/include -mmacosx-version-min=14-arm -mmacosx-version-min=11.0 -O0 -fpermissive -Werror=implicit-function-declaration -Werror=unknown-warning-option -Werror=unused-command-line-argument -Werror=ignored-optimization-argument 

Code:
 
        #include <version>
        int main(void) {
            /* If it's not defined as a macro, try to use as a symbol */
            #ifndef _LIBCPP_VERSION
                _LIBCPP_VERSION;
            #endif
            return 0;
        }
Cached compiler stdout:
 
Cached compiler stderr:
 
Using cached compile:
Cached command line:  arm64-apple-darwin20.0.0-clang++ /Users/jenkins/j/workspace/release/tarball/eb40a89f6a/build/conda/envs/lsst-scipipe-12.1.0/share/eups/EupsBuildDir/Darwin/gauss2d_fit-g199a45376c+0658834863/gauss2d_fit-g199a45376c+0658834863/build-release/meson-private/tmp5nwwh0eb/testfile.cpp -E -P -ftree-vectorize -fPIC -fstack-protector-strong -O2 -pipe -stdlib=libc++ -fvisibility-inlines-hidden -fmessage-length=0 -isystem /Users/jenkins/j/workspace/release/tarball/eb40a89f6a/build/conda/envs/lsst-scipipe-12.1.0/include -D_FORTIFY_SOURCE=2 -isystem /Users/jenkins/j/workspace/release/tarball/eb40a89f6a/build/conda/envs/lsst-scipipe-12.1.0/include -mmacosx-version-min=14-arm -mmacosx-version-min=11.0 -P -O0 -fpermissive -Werror=implicit-function-declaration 

Code:
 
        #ifdef __has_include
         #if !__has_include("version")
          #error "Header 'version' could not be found"
         #endif
        #else
         #include <version>
        #endif
Cached compiler stdout:
 

Cached compiler stderr:
 
Using cached compile:
Cached command line:  arm64-apple-darwin20.0.0-clang++ /Users/jenkins/j/workspace/release/tarball/eb40a89f6a/build/conda/envs/lsst-scipipe-12.1.0/share/eups/EupsBuildDir/Darwin/gauss2d_fit-g199a45376c+0658834863/gauss2d_fit-g199a45376c+0658834863/build-release/meson-private/tmpns_s6l_k/testfile.cpp -o /Users/jenkins/j/workspace/release/tarball/eb40a89f6a/build/conda/envs/lsst-scipipe-12.1.0/share/eups/EupsBuildDir/Darwin/gauss2d_fit-g199a45376c+0658834863/gauss2d_fit-g199a45376c+0658834863/build-release/meson-private/tmpns_s6l_k/output.obj -c -ftree-vectorize -fPIC -fstack-protector-strong -O2 -pipe -stdlib=libc++ -fvisibility-inlines-hidden -fmessage-length=0 -isystem /Users/jenkins/j/workspace/release/tarball/eb40a89f6a/build/conda/envs/lsst-scipipe-12.1.0/include -D_FORTIFY_SOURCE=2 -isystem /Users/jenkins/j/workspace/release/tarball/eb40a89f6a/build/conda/envs/lsst-scipipe-12.1.0/include -mmacosx-version-min=14-arm -mmacosx-version-min=11.0 -O0 -fpermissive -Werror=implicit-function-declaration -Werror=unknown-warning-option -Werror=unused-command-line-argument -Werror=ignored-optimization-argument 

Code:
 
        #include <version>
        int main(void) {
            /* If it's not defined as a macro, try to use as a symbol */
            #ifndef _LIBCPP_VERSION
                _LIBCPP_VERSION;
            #endif
            return 0;
        }
Cached compiler stdout:
 
Cached compiler stderr:
 
Using cached compile:
Cached command line:  arm64-apple-darwin20.0.0-clang++ /Users/jenkins/j/workspace/release/tarball/eb40a89f6a/build/conda/envs/lsst-scipipe-12.1.0/share/eups/EupsBuildDir/Darwin/gauss2d_fit-g199a45376c+0658834863/gauss2d_fit-g199a45376c+0658834863/build-release/meson-private/tmp5nwwh0eb/testfile.cpp -E -P -ftree-vectorize -fPIC -fstack-protector-strong -O2 -pipe -stdlib=libc++ -fvisibility-inlines-hidden -fmessage-length=0 -isystem /Users/jenkins/j/workspace/release/tarball/eb40a89f6a/build/conda/envs/lsst-scipipe-12.1.0/include -D_FORTIFY_SOURCE=2 -isystem /Users/jenkins/j/workspace/release/tarball/eb40a89f6a/build/conda/envs/lsst-scipipe-12.1.0/include -mmacosx-version-min=14-arm -mmacosx-version-min=11.0 -P -O0 -fpermissive -Werror=implicit-function-declaration 

Code:
 
        #ifdef __has_include
         #if !__has_include("version")
          #error "Header 'version' could not be found"
         #endif
        #else
         #include <version>
        #endif
Cached compiler stdout:
 

Cached compiler stderr:
 
Using cached compile:
Cached command line:  arm64-apple-darwin20.0.0-clang++ /Users/jenkins/j/workspace/release/tarball/eb40a89f6a/build/conda/envs/lsst-scipipe-12.1.0/share/eups/EupsBuildDir/Darwin/gauss2d_fit-g199a45376c+0658834863/gauss2d_fit-g199a45376c+0658834863/build-release/meson-private/tmpns_s6l_k/testfile.cpp -o /Users/jenkins/j/workspace/release/tarball/eb40a89f6a/build/conda/envs/lsst-scipipe-12.1.0/share/eups/EupsBuildDir/Darwin/gauss2d_fit-g199a45376c+0658834863/gauss2d_fit-g199a45376c+0658834863/build-release/meson-private/tmpns_s6l_k/output.obj -c -ftree-vectorize -fPIC -fstack-protector-strong -O2 -pipe -stdlib=libc++ -fvisibility-inlines-hidden -fmessage-length=0 -isystem /Users/jenkins/j/workspace/release/tarball/eb40a89f6a/build/conda/envs/lsst-scipipe-12.1.0/include -D_FORTIFY_SOURCE=2 -isystem /Users/jenkins/j/workspace/release/tarball/eb40a89f6a/build/conda/envs/lsst-scipipe-12.1.0/include -mmacosx-version-min=14-arm -mmacosx-version-min=11.0 -O0 -fpermissive -Werror=implicit-function-declaration -Werror=unknown-warning-option -Werror=unused-command-line-argument -Werror=ignored-optimization-argument 

Code:
 
        #include <version>
        int main(void) {
            /* If it's not defined as a macro, try to use as a symbol */
            #ifndef _LIBCPP_VERSION
                _LIBCPP_VERSION;
            #endif
            return 0;
        }
Cached compiler stdout:
 
Cached compiler stderr:
 
Using cached compile:
Cached command line:  arm64-apple-darwin20.0.0-clang++ /Users/jenkins/j/workspace/release/tarball/eb40a89f6a/build/conda/envs/lsst-scipipe-12.1.0/share/eups/EupsBuildDir/Darwin/gauss2d_fit-g199a45376c+0658834863/gauss2d_fit-g199a45376c+0658834863/build-release/meson-private/tmp5nwwh0eb/testfile.cpp -E -P -ftree-vectorize -fPIC -fstack-protector-strong -O2 -pipe -stdlib=libc++ -fvisibility-inlines-hidden -fmessage-length=0 -isystem /Users/jenkins/j/workspace/release/tarball/eb40a89f6a/build/conda/envs/lsst-scipipe-12.1.0/include -D_FORTIFY_SOURCE=2 -isystem /Users/jenkins/j/workspace/release/tarball/eb40a89f6a/build/conda/envs/lsst-scipipe-12.1.0/include -mmacosx-version-min=14-arm -mmacosx-version-min=11.0 -P -O0 -fpermissive -Werror=implicit-function-declaration 

Code:
 
        #ifdef __has_include
         #if !__has_include("version")
          #error "Header 'version' could not be found"
         #endif
        #else
         #include <version>
        #endif
Cached compiler stdout:
 

Cached compiler stderr:
 
Using cached compile:
Cached command line:  arm64-apple-darwin20.0.0-clang++ /Users/jenkins/j/workspace/release/tarball/eb40a89f6a/build/conda/envs/lsst-scipipe-12.1.0/share/eups/EupsBuildDir/Darwin/gauss2d_fit-g199a45376c+0658834863/gauss2d_fit-g199a45376c+0658834863/build-release/meson-private/tmpns_s6l_k/testfile.cpp -o /Users/jenkins/j/workspace/release/tarball/eb40a89f6a/build/conda/envs/lsst-scipipe-12.1.0/share/eups/EupsBuildDir/Darwin/gauss2d_fit-g199a45376c+0658834863/gauss2d_fit-g199a45376c+0658834863/build-release/meson-private/tmpns_s6l_k/output.obj -c -ftree-vectorize -fPIC -fstack-protector-strong -O2 -pipe -stdlib=libc++ -fvisibility-inlines-hidden -fmessage-length=0 -isystem /Users/jenkins/j/workspace/release/tarball/eb40a89f6a/build/conda/envs/lsst-scipipe-12.1.0/include -D_FORTIFY_SOURCE=2 -isystem /Users/jenkins/j/workspace/release/tarball/eb40a89f6a/build/conda/envs/lsst-scipipe-12.1.0/include -mmacosx-version-min=14-arm -mmacosx-version-min=11.0 -O0 -fpermissive -Werror=implicit-function-declaration -Werror=unknown-warning-option -Werror=unused-command-line-argument -Werror=ignored-optimization-argument 

Code:
 
        #include <version>
        int main(void) {
            /* If it's not defined as a macro, try to use as a symbol */
            #ifndef _LIBCPP_VERSION
                _LIBCPP_VERSION;
            #endif
            return 0;
        }
Cached compiler stdout:
 
Cached compiler stderr:
 
Using cached compile:
Cached command line:  arm64-apple-darwin20.0.0-clang++ /Users/jenkins/j/workspace/release/tarball/eb40a89f6a/build/conda/envs/lsst-scipipe-12.1.0/share/eups/EupsBuildDir/Darwin/gauss2d_fit-g199a45376c+0658834863/gauss2d_fit-g199a45376c+0658834863/build-release/meson-private/tmp5nwwh0eb/testfile.cpp -E -P -ftree-vectorize -fPIC -fstack-protector-strong -O2 -pipe -stdlib=libc++ -fvisibility-inlines-hidden -fmessage-length=0 -isystem /Users/jenkins/j/workspace/release/tarball/eb40a89f6a/build/conda/envs/lsst-scipipe-12.1.0/include -D_FORTIFY_SOURCE=2 -isystem /Users/jenkins/j/workspace/release/tarball/eb40a89f6a/build/conda/envs/lsst-scipipe-12.1.0/include -mmacosx-version-min=14-arm -mmacosx-version-min=11.0 -P -O0 -fpermissive -Werror=implicit-function-declaration 

Code:
 
        #ifdef __has_include
         #if !__has_include("version")
          #error "Header 'version' could not be found"
         #endif
        #else
         #include <version>
        #endif
Cached compiler stdout:
 

Cached compiler stderr:
 
Using cached compile:
Cached command line:  arm64-apple-darwin20.0.0-clang++ /Users/jenkins/j/workspace/release/tarball/eb40a89f6a/build/conda/envs/lsst-scipipe-12.1.0/share/eups/EupsBuildDir/Darwin/gauss2d_fit-g199a45376c+0658834863/gauss2d_fit-g199a45376c+0658834863/build-release/meson-private/tmpns_s6l_k/testfile.cpp -o /Users/jenkins/j/workspace/release/tarball/eb40a89f6a/build/conda/envs/lsst-scipipe-12.1.0/share/eups/EupsBuildDir/Darwin/gauss2d_fit-g199a45376c+0658834863/gauss2d_fit-g199a45376c+0658834863/build-release/meson-private/tmpns_s6l_k/output.obj -c -ftree-vectorize -fPIC -fstack-protector-strong -O2 -pipe -stdlib=libc++ -fvisibility-inlines-hidden -fmessage-length=0 -isystem /Users/jenkins/j/workspace/release/tarball/eb40a89f6a/build/conda/envs/lsst-scipipe-12.1.0/include -D_FORTIFY_SOURCE=2 -isystem /Users/jenkins/j/workspace/release/tarball/eb40a89f6a/build/conda/envs/lsst-scipipe-12.1.0/include -mmacosx-version-min=14-arm -mmacosx-version-min=11.0 -O0 -fpermissive -Werror=implicit-function-declaration -Werror=unknown-warning-option -Werror=unused-command-line-argument -Werror=ignored-optimization-argument 

Code:
 
        #include <version>
        int main(void) {
            /* If it's not defined as a macro, try to use as a symbol */
            #ifndef _LIBCPP_VERSION
                _LIBCPP_VERSION;
            #endif
            return 0;
        }
Cached compiler stdout:
 
Cached compiler stderr:
 
Using cached compile:
Cached command line:  arm64-apple-darwin20.0.0-clang++ /Users/jenkins/j/workspace/release/tarball/eb40a89f6a/build/conda/envs/lsst-scipipe-12.1.0/share/eups/EupsBuildDir/Darwin/gauss2d_fit-g199a45376c+0658834863/gauss2d_fit-g199a45376c+0658834863/build-release/meson-private/tmp5nwwh0eb/testfile.cpp -E -P -ftree-vectorize -fPIC -fstack-protector-strong -O2 -pipe -stdlib=libc++ -fvisibility-inlines-hidden -fmessage-length=0 -isystem /Users/jenkins/j/workspace/release/tarball/eb40a89f6a/build/conda/envs/lsst-scipipe-12.1.0/include -D_FORTIFY_SOURCE=2 -isystem /Users/jenkins/j/workspace/release/tarball/eb40a89f6a/build/conda/envs/lsst-scipipe-12.1.0/include -mmacosx-version-min=14-arm -mmacosx-version-min=11.0 -P -O0 -fpermissive -Werror=implicit-function-declaration 

Code:
 
        #ifdef __has_include
         #if !__has_include("version")
          #error "Header 'version' could not be found"
         #endif
        #else
         #include <version>
        #endif
Cached compiler stdout:
 

Cached compiler stderr:
 
Using cached compile:
Cached command line:  arm64-apple-darwin20.0.0-clang++ /Users/jenkins/j/workspace/release/tarball/eb40a89f6a/build/conda/envs/lsst-scipipe-12.1.0/share/eups/EupsBuildDir/Darwin/gauss2d_fit-g199a45376c+0658834863/gauss2d_fit-g199a45376c+0658834863/build-release/meson-private/tmpns_s6l_k/testfile.cpp -o /Users/jenkins/j/workspace/release/tarball/eb40a89f6a/build/conda/envs/lsst-scipipe-12.1.0/share/eups/EupsBuildDir/Darwin/gauss2d_fit-g199a45376c+0658834863/gauss2d_fit-g199a45376c+0658834863/build-release/meson-private/tmpns_s6l_k/output.obj -c -ftree-vectorize -fPIC -fstack-protector-strong -O2 -pipe -stdlib=libc++ -fvisibility-inlines-hidden -fmessage-length=0 -isystem /Users/jenkins/j/workspace/release/tarball/eb40a89f6a/build/conda/envs/lsst-scipipe-12.1.0/include -D_FORTIFY_SOURCE=2 -isystem /Users/jenkins/j/workspace/release/tarball/eb40a89f6a/build/conda/envs/lsst-scipipe-12.1.0/include -mmacosx-version-min=14-arm -mmacosx-version-min=11.0 -O0 -fpermissive -Werror=implicit-function-declaration -Werror=unknown-warning-option -Werror=unused-command-line-argument -Werror=ignored-optimization-argument 

Code:
 
        #include <version>
        int main(void) {
            /* If it's not defined as a macro, try to use as a symbol */
            #ifndef _LIBCPP_VERSION
                _LIBCPP_VERSION;
            #endif
            return 0;
        }
Cached compiler stdout:
 
Cached compiler stderr:
 
Using cached compile:
Cached command line:  arm64-apple-darwin20.0.0-clang++ /Users/jenkins/j/workspace/release/tarball/eb40a89f6a/build/conda/envs/lsst-scipipe-12.1.0/share/eups/EupsBuildDir/Darwin/gauss2d_fit-g199a45376c+0658834863/gauss2d_fit-g199a45376c+0658834863/build-release/meson-private/tmp5nwwh0eb/testfile.cpp -E -P -ftree-vectorize -fPIC -fstack-protector-strong -O2 -pipe -stdlib=libc++ -fvisibility-inlines-hidden -fmessage-length=0 -isystem /Users/jenkins/j/workspace/release/tarball/eb40a89f6a/build/conda/envs/lsst-scipipe-12.1.0/include -D_FORTIFY_SOURCE=2 -isystem /Users/jenkins/j/workspace/release/tarball/eb40a89f6a/build/conda/envs/lsst-scipipe-12.1.0/include -mmacosx-version-min=14-arm -mmacosx-version-min=11.0 -P -O0 -fpermissive -Werror=implicit-function-declaration 

Code:
 
        #ifdef __has_include
         #if !__has_include("version")
          #error "Header 'version' could not be found"
         #endif
        #else
         #include <version>
        #endif
Cached compiler stdout:
 

Cached compiler stderr:
 
Using cached compile:
Cached command line:  arm64-apple-darwin20.0.0-clang++ /Users/jenkins/j/workspace/release/tarball/eb40a89f6a/build/conda/envs/lsst-scipipe-12.1.0/share/eups/EupsBuildDir/Darwin/gauss2d_fit-g199a45376c+0658834863/gauss2d_fit-g199a45376c+0658834863/build-release/meson-private/tmpns_s6l_k/testfile.cpp -o /Users/jenkins/j/workspace/release/tarball/eb40a89f6a/build/conda/envs/lsst-scipipe-12.1.0/share/eups/EupsBuildDir/Darwin/gauss2d_fit-g199a45376c+0658834863/gauss2d_fit-g199a45376c+0658834863/build-release/meson-private/tmpns_s6l_k/output.obj -c -ftree-vectorize -fPIC -fstack-protector-strong -O2 -pipe -stdlib=libc++ -fvisibility-inlines-hidden -fmessage-length=0 -isystem /Users/jenkins/j/workspace/release/tarball/eb40a89f6a/build/conda/envs/lsst-scipipe-12.1.0/include -D_FORTIFY_SOURCE=2 -isystem /Users/jenkins/j/workspace/release/tarball/eb40a89f6a/build/conda/envs/lsst-scipipe-12.1.0/include -mmacosx-version-min=14-arm -mmacosx-version-min=11.0 -O0 -fpermissive -Werror=implicit-function-declaration -Werror=unknown-warning-option -Werror=unused-command-line-argument -Werror=ignored-optimization-argument 

Code:
 
        #include <version>
        int main(void) {
            /* If it's not defined as a macro, try to use as a symbol */
            #ifndef _LIBCPP_VERSION
                _LIBCPP_VERSION;
            #endif
            return 0;
        }
Cached compiler stdout:
 
Cached compiler stderr:
 
Using cached compile:
Cached command line:  arm64-apple-darwin20.0.0-clang++ /Users/jenkins/j/workspace/release/tarball/eb40a89f6a/build/conda/envs/lsst-scipipe-12.1.0/share/eups/EupsBuildDir/Darwin/gauss2d_fit-g199a45376c+0658834863/gauss2d_fit-g199a45376c+0658834863/build-release/meson-private/tmp5nwwh0eb/testfile.cpp -E -P -ftree-vectorize -fPIC -fstack-protector-strong -O2 -pipe -stdlib=libc++ -fvisibility-inlines-hidden -fmessage-length=0 -isystem /Users/jenkins/j/workspace/release/tarball/eb40a89f6a/build/conda/envs/lsst-scipipe-12.1.0/include -D_FORTIFY_SOURCE=2 -isystem /Users/jenkins/j/workspace/release/tarball/eb40a89f6a/build/conda/envs/lsst-scipipe-12.1.0/include -mmacosx-version-min=14-arm -mmacosx-version-min=11.0 -P -O0 -fpermissive -Werror=implicit-function-declaration 

Code:
 
        #ifdef __has_include
         #if !__has_include("version")
          #error "Header 'version' could not be found"
         #endif
        #else
         #include <version>
        #endif
Cached compiler stdout:
 

Cached compiler stderr:
 
Using cached compile:
Cached command line:  arm64-apple-darwin20.0.0-clang++ /Users/jenkins/j/workspace/release/tarball/eb40a89f6a/build/conda/envs/lsst-scipipe-12.1.0/share/eups/EupsBuildDir/Darwin/gauss2d_fit-g199a45376c+0658834863/gauss2d_fit-g199a45376c+0658834863/build-release/meson-private/tmpns_s6l_k/testfile.cpp -o /Users/jenkins/j/workspace/release/tarball/eb40a89f6a/build/conda/envs/lsst-scipipe-12.1.0/share/eups/EupsBuildDir/Darwin/gauss2d_fit-g199a45376c+0658834863/gauss2d_fit-g199a45376c+0658834863/build-release/meson-private/tmpns_s6l_k/output.obj -c -ftree-vectorize -fPIC -fstack-protector-strong -O2 -pipe -stdlib=libc++ -fvisibility-inlines-hidden -fmessage-length=0 -isystem /Users/jenkins/j/workspace/release/tarball/eb40a89f6a/build/conda/envs/lsst-scipipe-12.1.0/include -D_FORTIFY_SOURCE=2 -isystem /Users/jenkins/j/workspace/release/tarball/eb40a89f6a/build/conda/envs/lsst-scipipe-12.1.0/include -mmacosx-version-min=14-arm -mmacosx-version-min=11.0 -O0 -fpermissive -Werror=implicit-function-declaration -Werror=unknown-warning-option -Werror=unused-command-line-argument -Werror=ignored-optimization-argument 

Code:
 
        #include <version>
        int main(void) {
            /* If it's not defined as a macro, try to use as a symbol */
            #ifndef _LIBCPP_VERSION
                _LIBCPP_VERSION;
            #endif
            return 0;
        }
Cached compiler stdout:
 
Cached compiler stderr:
 
Using cached compile:
Cached command line:  arm64-apple-darwin20.0.0-clang++ /Users/jenkins/j/workspace/release/tarball/eb40a89f6a/build/conda/envs/lsst-scipipe-12.1.0/share/eups/EupsBuildDir/Darwin/gauss2d_fit-g199a45376c+0658834863/gauss2d_fit-g199a45376c+0658834863/build-release/meson-private/tmp5nwwh0eb/testfile.cpp -E -P -ftree-vectorize -fPIC -fstack-protector-strong -O2 -pipe -stdlib=libc++ -fvisibility-inlines-hidden -fmessage-length=0 -isystem /Users/jenkins/j/workspace/release/tarball/eb40a89f6a/build/conda/envs/lsst-scipipe-12.1.0/include -D_FORTIFY_SOURCE=2 -isystem /Users/jenkins/j/workspace/release/tarball/eb40a89f6a/build/conda/envs/lsst-scipipe-12.1.0/include -mmacosx-version-min=14-arm -mmacosx-version-min=11.0 -P -O0 -fpermissive -Werror=implicit-function-declaration 

Code:
 
        #ifdef __has_include
         #if !__has_include("version")
          #error "Header 'version' could not be found"
         #endif
        #else
         #include <version>
        #endif
Cached compiler stdout:
 

Cached compiler stderr:
 
Using cached compile:
Cached command line:  arm64-apple-darwin20.0.0-clang++ /Users/jenkins/j/workspace/release/tarball/eb40a89f6a/build/conda/envs/lsst-scipipe-12.1.0/share/eups/EupsBuildDir/Darwin/gauss2d_fit-g199a45376c+0658834863/gauss2d_fit-g199a45376c+0658834863/build-release/meson-private/tmpns_s6l_k/testfile.cpp -o /Users/jenkins/j/workspace/release/tarball/eb40a89f6a/build/conda/envs/lsst-scipipe-12.1.0/share/eups/EupsBuildDir/Darwin/gauss2d_fit-g199a45376c+0658834863/gauss2d_fit-g199a45376c+0658834863/build-release/meson-private/tmpns_s6l_k/output.obj -c -ftree-vectorize -fPIC -fstack-protector-strong -O2 -pipe -stdlib=libc++ -fvisibility-inlines-hidden -fmessage-length=0 -isystem /Users/jenkins/j/workspace/release/tarball/eb40a89f6a/build/conda/envs/lsst-scipipe-12.1.0/include -D_FORTIFY_SOURCE=2 -isystem /Users/jenkins/j/workspace/release/tarball/eb40a89f6a/build/conda/envs/lsst-scipipe-12.1.0/include -mmacosx-version-min=14-arm -mmacosx-version-min=11.0 -O0 -fpermissive -Werror=implicit-function-declaration -Werror=unknown-warning-option -Werror=unused-command-line-argument -Werror=ignored-optimization-argument 

Code:
 
        #include <version>
        int main(void) {
            /* If it's not defined as a macro, try to use as a symbol */
            #ifndef _LIBCPP_VERSION
                _LIBCPP_VERSION;
            #endif
            return 0;
        }
Cached compiler stdout:
 
Cached compiler stderr:
 
Using cached compile:
Cached command line:  arm64-apple-darwin20.0.0-clang++ /Users/jenkins/j/workspace/release/tarball/eb40a89f6a/build/conda/envs/lsst-scipipe-12.1.0/share/eups/EupsBuildDir/Darwin/gauss2d_fit-g199a45376c+0658834863/gauss2d_fit-g199a45376c+0658834863/build-release/meson-private/tmp5nwwh0eb/testfile.cpp -E -P -ftree-vectorize -fPIC -fstack-protector-strong -O2 -pipe -stdlib=libc++ -fvisibility-inlines-hidden -fmessage-length=0 -isystem /Users/jenkins/j/workspace/release/tarball/eb40a89f6a/build/conda/envs/lsst-scipipe-12.1.0/include -D_FORTIFY_SOURCE=2 -isystem /Users/jenkins/j/workspace/release/tarball/eb40a89f6a/build/conda/envs/lsst-scipipe-12.1.0/include -mmacosx-version-min=14-arm -mmacosx-version-min=11.0 -P -O0 -fpermissive -Werror=implicit-function-declaration 

Code:
 
        #ifdef __has_include
         #if !__has_include("version")
          #error "Header 'version' could not be found"
         #endif
        #else
         #include <version>
        #endif
Cached compiler stdout:
 

Cached compiler stderr:
 
Using cached compile:
Cached command line:  arm64-apple-darwin20.0.0-clang++ /Users/jenkins/j/workspace/release/tarball/eb40a89f6a/build/conda/envs/lsst-scipipe-12.1.0/share/eups/EupsBuildDir/Darwin/gauss2d_fit-g199a45376c+0658834863/gauss2d_fit-g199a45376c+0658834863/build-release/meson-private/tmpns_s6l_k/testfile.cpp -o /Users/jenkins/j/workspace/release/tarball/eb40a89f6a/build/conda/envs/lsst-scipipe-12.1.0/share/eups/EupsBuildDir/Darwin/gauss2d_fit-g199a45376c+0658834863/gauss2d_fit-g199a45376c+0658834863/build-release/meson-private/tmpns_s6l_k/output.obj -c -ftree-vectorize -fPIC -fstack-protector-strong -O2 -pipe -stdlib=libc++ -fvisibility-inlines-hidden -fmessage-length=0 -isystem /Users/jenkins/j/workspace/release/tarball/eb40a89f6a/build/conda/envs/lsst-scipipe-12.1.0/include -D_FORTIFY_SOURCE=2 -isystem /Users/jenkins/j/workspace/release/tarball/eb40a89f6a/build/conda/envs/lsst-scipipe-12.1.0/include -mmacosx-version-min=14-arm -mmacosx-version-min=11.0 -O0 -fpermissive -Werror=implicit-function-declaration -Werror=unknown-warning-option -Werror=unused-command-line-argument -Werror=ignored-optimization-argument 

Code:
 
        #include <version>
        int main(void) {
            /* If it's not defined as a macro, try to use as a symbol */
            #ifndef _LIBCPP_VERSION
                _LIBCPP_VERSION;
            #endif
            return 0;
        }
Cached compiler stdout:
 
Cached compiler stderr:
 
Using cached compile:
Cached command line:  arm64-apple-darwin20.0.0-clang++ /Users/jenkins/j/workspace/release/tarball/eb40a89f6a/build/conda/envs/lsst-scipipe-12.1.0/share/eups/EupsBuildDir/Darwin/gauss2d_fit-g199a45376c+0658834863/gauss2d_fit-g199a45376c+0658834863/build-release/meson-private/tmp5nwwh0eb/testfile.cpp -E -P -ftree-vectorize -fPIC -fstack-protector-strong -O2 -pipe -stdlib=libc++ -fvisibility-inlines-hidden -fmessage-length=0 -isystem /Users/jenkins/j/workspace/release/tarball/eb40a89f6a/build/conda/envs/lsst-scipipe-12.1.0/include -D_FORTIFY_SOURCE=2 -isystem /Users/jenkins/j/workspace/release/tarball/eb40a89f6a/build/conda/envs/lsst-scipipe-12.1.0/include -mmacosx-version-min=14-arm -mmacosx-version-min=11.0 -P -O0 -fpermissive -Werror=implicit-function-declaration 

Code:
 
        #ifdef __has_include
         #if !__has_include("version")
          #error "Header 'version' could not be found"
         #endif
        #else
         #include <version>
        #endif
Cached compiler stdout:
 

Cached compiler stderr:
 
Using cached compile:
Cached command line:  arm64-apple-darwin20.0.0-clang++ /Users/jenkins/j/workspace/release/tarball/eb40a89f6a/build/conda/envs/lsst-scipipe-12.1.0/share/eups/EupsBuildDir/Darwin/gauss2d_fit-g199a45376c+0658834863/gauss2d_fit-g199a45376c+0658834863/build-release/meson-private/tmpns_s6l_k/testfile.cpp -o /Users/jenkins/j/workspace/release/tarball/eb40a89f6a/build/conda/envs/lsst-scipipe-12.1.0/share/eups/EupsBuildDir/Darwin/gauss2d_fit-g199a45376c+0658834863/gauss2d_fit-g199a45376c+0658834863/build-release/meson-private/tmpns_s6l_k/output.obj -c -ftree-vectorize -fPIC -fstack-protector-strong -O2 -pipe -stdlib=libc++ -fvisibility-inlines-hidden -fmessage-length=0 -isystem /Users/jenkins/j/workspace/release/tarball/eb40a89f6a/build/conda/envs/lsst-scipipe-12.1.0/include -D_FORTIFY_SOURCE=2 -isystem /Users/jenkins/j/workspace/release/tarball/eb40a89f6a/build/conda/envs/lsst-scipipe-12.1.0/include -mmacosx-version-min=14-arm -mmacosx-version-min=11.0 -O0 -fpermissive -Werror=implicit-function-declaration -Werror=unknown-warning-option -Werror=unused-command-line-argument -Werror=ignored-optimization-argument 

Code:
 
        #include <version>
        int main(void) {
            /* If it's not defined as a macro, try to use as a symbol */
            #ifndef _LIBCPP_VERSION
                _LIBCPP_VERSION;
            #endif
            return 0;
        }
Cached compiler stdout:
 
Cached compiler stderr:
 
Using cached compile:
Cached command line:  arm64-apple-darwin20.0.0-clang++ /Users/jenkins/j/workspace/release/tarball/eb40a89f6a/build/conda/envs/lsst-scipipe-12.1.0/share/eups/EupsBuildDir/Darwin/gauss2d_fit-g199a45376c+0658834863/gauss2d_fit-g199a45376c+0658834863/build-release/meson-private/tmp5nwwh0eb/testfile.cpp -E -P -ftree-vectorize -fPIC -fstack-protector-strong -O2 -pipe -stdlib=libc++ -fvisibility-inlines-hidden -fmessage-length=0 -isystem /Users/jenkins/j/workspace/release/tarball/eb40a89f6a/build/conda/envs/lsst-scipipe-12.1.0/include -D_FORTIFY_SOURCE=2 -isystem /Users/jenkins/j/workspace/release/tarball/eb40a89f6a/build/conda/envs/lsst-scipipe-12.1.0/include -mmacosx-version-min=14-arm -mmacosx-version-min=11.0 -P -O0 -fpermissive -Werror=implicit-function-declaration 

Code:
 
        #ifdef __has_include
         #if !__has_include("version")
          #error "Header 'version' could not be found"
         #endif
        #else
         #include <version>
        #endif
Cached compiler stdout:
 

Cached compiler stderr:
 
Using cached compile:
Cached command line:  arm64-apple-darwin20.0.0-clang++ /Users/jenkins/j/workspace/release/tarball/eb40a89f6a/build/conda/envs/lsst-scipipe-12.1.0/share/eups/EupsBuildDir/Darwin/gauss2d_fit-g199a45376c+0658834863/gauss2d_fit-g199a45376c+0658834863/build-release/meson-private/tmpns_s6l_k/testfile.cpp -o /Users/jenkins/j/workspace/release/tarball/eb40a89f6a/build/conda/envs/lsst-scipipe-12.1.0/share/eups/EupsBuildDir/Darwin/gauss2d_fit-g199a45376c+0658834863/gauss2d_fit-g199a45376c+0658834863/build-release/meson-private/tmpns_s6l_k/output.obj -c -ftree-vectorize -fPIC -fstack-protector-strong -O2 -pipe -stdlib=libc++ -fvisibility-inlines-hidden -fmessage-length=0 -isystem /Users/jenkins/j/workspace/release/tarball/eb40a89f6a/build/conda/envs/lsst-scipipe-12.1.0/include -D_FORTIFY_SOURCE=2 -isystem /Users/jenkins/j/workspace/release/tarball/eb40a89f6a/build/conda/envs/lsst-scipipe-12.1.0/include -mmacosx-version-min=14-arm -mmacosx-version-min=11.0 -O0 -fpermissive -Werror=implicit-function-declaration -Werror=unknown-warning-option -Werror=unused-command-line-argument -Werror=ignored-optimization-argument 

Code:
 
        #include <version>
        int main(void) {
            /* If it's not defined as a macro, try to use as a symbol */
            #ifndef _LIBCPP_VERSION
                _LIBCPP_VERSION;
            #endif
            return 0;
        }
Cached compiler stdout:
 
Cached compiler stderr:
 
Using cached compile:
Cached command line:  arm64-apple-darwin20.0.0-clang++ /Users/jenkins/j/workspace/release/tarball/eb40a89f6a/build/conda/envs/lsst-scipipe-12.1.0/share/eups/EupsBuildDir/Darwin/gauss2d_fit-g199a45376c+0658834863/gauss2d_fit-g199a45376c+0658834863/build-release/meson-private/tmp5nwwh0eb/testfile.cpp -E -P -ftree-vectorize -fPIC -fstack-protector-strong -O2 -pipe -stdlib=libc++ -fvisibility-inlines-hidden -fmessage-length=0 -isystem /Users/jenkins/j/workspace/release/tarball/eb40a89f6a/build/conda/envs/lsst-scipipe-12.1.0/include -D_FORTIFY_SOURCE=2 -isystem /Users/jenkins/j/workspace/release/tarball/eb40a89f6a/build/conda/envs/lsst-scipipe-12.1.0/include -mmacosx-version-min=14-arm -mmacosx-version-min=11.0 -P -O0 -fpermissive -Werror=implicit-function-declaration 

Code:
 
        #ifdef __has_include
         #if !__has_include("version")
          #error "Header 'version' could not be found"
         #endif
        #else
         #include <version>
        #endif
Cached compiler stdout:
 

Cached compiler stderr:
 
Using cached compile:
Cached command line:  arm64-apple-darwin20.0.0-clang++ /Users/jenkins/j/workspace/release/tarball/eb40a89f6a/build/conda/envs/lsst-scipipe-12.1.0/share/eups/EupsBuildDir/Darwin/gauss2d_fit-g199a45376c+0658834863/gauss2d_fit-g199a45376c+0658834863/build-release/meson-private/tmpns_s6l_k/testfile.cpp -o /Users/jenkins/j/workspace/release/tarball/eb40a89f6a/build/conda/envs/lsst-scipipe-12.1.0/share/eups/EupsBuildDir/Darwin/gauss2d_fit-g199a45376c+0658834863/gauss2d_fit-g199a45376c+0658834863/build-release/meson-private/tmpns_s6l_k/output.obj -c -ftree-vectorize -fPIC -fstack-protector-strong -O2 -pipe -stdlib=libc++ -fvisibility-inlines-hidden -fmessage-length=0 -isystem /Users/jenkins/j/workspace/release/tarball/eb40a89f6a/build/conda/envs/lsst-scipipe-12.1.0/include -D_FORTIFY_SOURCE=2 -isystem /Users/jenkins/j/workspace/release/tarball/eb40a89f6a/build/conda/envs/lsst-scipipe-12.1.0/include -mmacosx-version-min=14-arm -mmacosx-version-min=11.0 -O0 -fpermissive -Werror=implicit-function-declaration -Werror=unknown-warning-option -Werror=unused-command-line-argument -Werror=ignored-optimization-argument 

Code:
 
        #include <version>
        int main(void) {
            /* If it's not defined as a macro, try to use as a symbol */
            #ifndef _LIBCPP_VERSION
                _LIBCPP_VERSION;
            #endif
            return 0;
        }
Cached compiler stdout:
 
Cached compiler stderr:
 
Using cached compile:
Cached command line:  arm64-apple-darwin20.0.0-clang++ /Users/jenkins/j/workspace/release/tarball/eb40a89f6a/build/conda/envs/lsst-scipipe-12.1.0/share/eups/EupsBuildDir/Darwin/gauss2d_fit-g199a45376c+0658834863/gauss2d_fit-g199a45376c+0658834863/build-release/meson-private/tmp5nwwh0eb/testfile.cpp -E -P -ftree-vectorize -fPIC -fstack-protector-strong -O2 -pipe -stdlib=libc++ -fvisibility-inlines-hidden -fmessage-length=0 -isystem /Users/jenkins/j/workspace/release/tarball/eb40a89f6a/build/conda/envs/lsst-scipipe-12.1.0/include -D_FORTIFY_SOURCE=2 -isystem /Users/jenkins/j/workspace/release/tarball/eb40a89f6a/build/conda/envs/lsst-scipipe-12.1.0/include -mmacosx-version-min=14-arm -mmacosx-version-min=11.0 -P -O0 -fpermissive -Werror=implicit-function-declaration 

Code:
 
        #ifdef __has_include
         #if !__has_include("version")
          #error "Header 'version' could not be found"
         #endif
        #else
         #include <version>
        #endif
Cached compiler stdout:
 

Cached compiler stderr:
 
Using cached compile:
Cached command line:  arm64-apple-darwin20.0.0-clang++ /Users/jenkins/j/workspace/release/tarball/eb40a89f6a/build/conda/envs/lsst-scipipe-12.1.0/share/eups/EupsBuildDir/Darwin/gauss2d_fit-g199a45376c+0658834863/gauss2d_fit-g199a45376c+0658834863/build-release/meson-private/tmpns_s6l_k/testfile.cpp -o /Users/jenkins/j/workspace/release/tarball/eb40a89f6a/build/conda/envs/lsst-scipipe-12.1.0/share/eups/EupsBuildDir/Darwin/gauss2d_fit-g199a45376c+0658834863/gauss2d_fit-g199a45376c+0658834863/build-release/meson-private/tmpns_s6l_k/output.obj -c -ftree-vectorize -fPIC -fstack-protector-strong -O2 -pipe -stdlib=libc++ -fvisibility-inlines-hidden -fmessage-length=0 -isystem /Users/jenkins/j/workspace/release/tarball/eb40a89f6a/build/conda/envs/lsst-scipipe-12.1.0/include -D_FORTIFY_SOURCE=2 -isystem /Users/jenkins/j/workspace/release/tarball/eb40a89f6a/build/conda/envs/lsst-scipipe-12.1.0/include -mmacosx-version-min=14-arm -mmacosx-version-min=11.0 -O0 -fpermissive -Werror=implicit-function-declaration -Werror=unknown-warning-option -Werror=unused-command-line-argument -Werror=ignored-optimization-argument 

Code:
 
        #include <version>
        int main(void) {
            /* If it's not defined as a macro, try to use as a symbol */
            #ifndef _LIBCPP_VERSION
                _LIBCPP_VERSION;
            #endif
            return 0;
        }
Cached compiler stdout:
 
Cached compiler stderr:
 
Using cached compile:
Cached command line:  arm64-apple-darwin20.0.0-clang++ /Users/jenkins/j/workspace/release/tarball/eb40a89f6a/build/conda/envs/lsst-scipipe-12.1.0/share/eups/EupsBuildDir/Darwin/gauss2d_fit-g199a45376c+0658834863/gauss2d_fit-g199a45376c+0658834863/build-release/meson-private/tmp5nwwh0eb/testfile.cpp -E -P -ftree-vectorize -fPIC -fstack-protector-strong -O2 -pipe -stdlib=libc++ -fvisibility-inlines-hidden -fmessage-length=0 -isystem /Users/jenkins/j/workspace/release/tarball/eb40a89f6a/build/conda/envs/lsst-scipipe-12.1.0/include -D_FORTIFY_SOURCE=2 -isystem /Users/jenkins/j/workspace/release/tarball/eb40a89f6a/build/conda/envs/lsst-scipipe-12.1.0/include -mmacosx-version-min=14-arm -mmacosx-version-min=11.0 -P -O0 -fpermissive -Werror=implicit-function-declaration 

Code:
 
        #ifdef __has_include
         #if !__has_include("version")
          #error "Header 'version' could not be found"
         #endif
        #else
         #include <version>
        #endif
Cached compiler stdout:
 

Cached compiler stderr:
 
Using cached compile:
Cached command line:  arm64-apple-darwin20.0.0-clang++ /Users/jenkins/j/workspace/release/tarball/eb40a89f6a/build/conda/envs/lsst-scipipe-12.1.0/share/eups/EupsBuildDir/Darwin/gauss2d_fit-g199a45376c+0658834863/gauss2d_fit-g199a45376c+0658834863/build-release/meson-private/tmpns_s6l_k/testfile.cpp -o /Users/jenkins/j/workspace/release/tarball/eb40a89f6a/build/conda/envs/lsst-scipipe-12.1.0/share/eups/EupsBuildDir/Darwin/gauss2d_fit-g199a45376c+0658834863/gauss2d_fit-g199a45376c+0658834863/build-release/meson-private/tmpns_s6l_k/output.obj -c -ftree-vectorize -fPIC -fstack-protector-strong -O2 -pipe -stdlib=libc++ -fvisibility-inlines-hidden -fmessage-length=0 -isystem /Users/jenkins/j/workspace/release/tarball/eb40a89f6a/build/conda/envs/lsst-scipipe-12.1.0/include -D_FORTIFY_SOURCE=2 -isystem /Users/jenkins/j/workspace/release/tarball/eb40a89f6a/build/conda/envs/lsst-scipipe-12.1.0/include -mmacosx-version-min=14-arm -mmacosx-version-min=11.0 -O0 -fpermissive -Werror=implicit-function-declaration -Werror=unknown-warning-option -Werror=unused-command-line-argument -Werror=ignored-optimization-argument 

Code:
 
        #include <version>
        int main(void) {
            /* If it's not defined as a macro, try to use as a symbol */
            #ifndef _LIBCPP_VERSION
                _LIBCPP_VERSION;
            #endif
            return 0;
        }
Cached compiler stdout:
 
Cached compiler stderr:
 
Using cached compile:
Cached command line:  arm64-apple-darwin20.0.0-clang++ /Users/jenkins/j/workspace/release/tarball/eb40a89f6a/build/conda/envs/lsst-scipipe-12.1.0/share/eups/EupsBuildDir/Darwin/gauss2d_fit-g199a45376c+0658834863/gauss2d_fit-g199a45376c+0658834863/build-release/meson-private/tmp5nwwh0eb/testfile.cpp -E -P -ftree-vectorize -fPIC -fstack-protector-strong -O2 -pipe -stdlib=libc++ -fvisibility-inlines-hidden -fmessage-length=0 -isystem /Users/jenkins/j/workspace/release/tarball/eb40a89f6a/build/conda/envs/lsst-scipipe-12.1.0/include -D_FORTIFY_SOURCE=2 -isystem /Users/jenkins/j/workspace/release/tarball/eb40a89f6a/build/conda/envs/lsst-scipipe-12.1.0/include -mmacosx-version-min=14-arm -mmacosx-version-min=11.0 -P -O0 -fpermissive -Werror=implicit-function-declaration 

Code:
 
        #ifdef __has_include
         #if !__has_include("version")
          #error "Header 'version' could not be found"
         #endif
        #else
         #include <version>
        #endif
Cached compiler stdout:
 

Cached compiler stderr:
 
Using cached compile:
Cached command line:  arm64-apple-darwin20.0.0-clang++ /Users/jenkins/j/workspace/release/tarball/eb40a89f6a/build/conda/envs/lsst-scipipe-12.1.0/share/eups/EupsBuildDir/Darwin/gauss2d_fit-g199a45376c+0658834863/gauss2d_fit-g199a45376c+0658834863/build-release/meson-private/tmpns_s6l_k/testfile.cpp -o /Users/jenkins/j/workspace/release/tarball/eb40a89f6a/build/conda/envs/lsst-scipipe-12.1.0/share/eups/EupsBuildDir/Darwin/gauss2d_fit-g199a45376c+0658834863/gauss2d_fit-g199a45376c+0658834863/build-release/meson-private/tmpns_s6l_k/output.obj -c -ftree-vectorize -fPIC -fstack-protector-strong -O2 -pipe -stdlib=libc++ -fvisibility-inlines-hidden -fmessage-length=0 -isystem /Users/jenkins/j/workspace/release/tarball/eb40a89f6a/build/conda/envs/lsst-scipipe-12.1.0/include -D_FORTIFY_SOURCE=2 -isystem /Users/jenkins/j/workspace/release/tarball/eb40a89f6a/build/conda/envs/lsst-scipipe-12.1.0/include -mmacosx-version-min=14-arm -mmacosx-version-min=11.0 -O0 -fpermissive -Werror=implicit-function-declaration -Werror=unknown-warning-option -Werror=unused-command-line-argument -Werror=ignored-optimization-argument 

Code:
 
        #include <version>
        int main(void) {
            /* If it's not defined as a macro, try to use as a symbol */
            #ifndef _LIBCPP_VERSION
                _LIBCPP_VERSION;
            #endif
            return 0;
        }
Cached compiler stdout:
 
Cached compiler stderr:
 
Using cached compile:
Cached command line:  arm64-apple-darwin20.0.0-clang++ /Users/jenkins/j/workspace/release/tarball/eb40a89f6a/build/conda/envs/lsst-scipipe-12.1.0/share/eups/EupsBuildDir/Darwin/gauss2d_fit-g199a45376c+0658834863/gauss2d_fit-g199a45376c+0658834863/build-release/meson-private/tmp5nwwh0eb/testfile.cpp -E -P -ftree-vectorize -fPIC -fstack-protector-strong -O2 -pipe -stdlib=libc++ -fvisibility-inlines-hidden -fmessage-length=0 -isystem /Users/jenkins/j/workspace/release/tarball/eb40a89f6a/build/conda/envs/lsst-scipipe-12.1.0/include -D_FORTIFY_SOURCE=2 -isystem /Users/jenkins/j/workspace/release/tarball/eb40a89f6a/build/conda/envs/lsst-scipipe-12.1.0/include -mmacosx-version-min=14-arm -mmacosx-version-min=11.0 -P -O0 -fpermissive -Werror=implicit-function-declaration 

Code:
 
        #ifdef __has_include
         #if !__has_include("version")
          #error "Header 'version' could not be found"
         #endif
        #else
         #include <version>
        #endif
Cached compiler stdout:
 

Cached compiler stderr:
 
Using cached compile:
Cached command line:  arm64-apple-darwin20.0.0-clang++ /Users/jenkins/j/workspace/release/tarball/eb40a89f6a/build/conda/envs/lsst-scipipe-12.1.0/share/eups/EupsBuildDir/Darwin/gauss2d_fit-g199a45376c+0658834863/gauss2d_fit-g199a45376c+0658834863/build-release/meson-private/tmpns_s6l_k/testfile.cpp -o /Users/jenkins/j/workspace/release/tarball/eb40a89f6a/build/conda/envs/lsst-scipipe-12.1.0/share/eups/EupsBuildDir/Darwin/gauss2d_fit-g199a45376c+0658834863/gauss2d_fit-g199a45376c+0658834863/build-release/meson-private/tmpns_s6l_k/output.obj -c -ftree-vectorize -fPIC -fstack-protector-strong -O2 -pipe -stdlib=libc++ -fvisibility-inlines-hidden -fmessage-length=0 -isystem /Users/jenkins/j/workspace/release/tarball/eb40a89f6a/build/conda/envs/lsst-scipipe-12.1.0/include -D_FORTIFY_SOURCE=2 -isystem /Users/jenkins/j/workspace/release/tarball/eb40a89f6a/build/conda/envs/lsst-scipipe-12.1.0/include -mmacosx-version-min=14-arm -mmacosx-version-min=11.0 -O0 -fpermissive -Werror=implicit-function-declaration -Werror=unknown-warning-option -Werror=unused-command-line-argument -Werror=ignored-optimization-argument 

Code:
 
        #include <version>
        int main(void) {
            /* If it's not defined as a macro, try to use as a symbol */
            #ifndef _LIBCPP_VERSION
                _LIBCPP_VERSION;
            #endif
            return 0;
        }
Cached compiler stdout:
 
Cached compiler stderr:
 
Using cached compile:
Cached command line:  arm64-apple-darwin20.0.0-clang++ /Users/jenkins/j/workspace/release/tarball/eb40a89f6a/build/conda/envs/lsst-scipipe-12.1.0/share/eups/EupsBuildDir/Darwin/gauss2d_fit-g199a45376c+0658834863/gauss2d_fit-g199a45376c+0658834863/build-release/meson-private/tmp5nwwh0eb/testfile.cpp -E -P -ftree-vectorize -fPIC -fstack-protector-strong -O2 -pipe -stdlib=libc++ -fvisibility-inlines-hidden -fmessage-length=0 -isystem /Users/jenkins/j/workspace/release/tarball/eb40a89f6a/build/conda/envs/lsst-scipipe-12.1.0/include -D_FORTIFY_SOURCE=2 -isystem /Users/jenkins/j/workspace/release/tarball/eb40a89f6a/build/conda/envs/lsst-scipipe-12.1.0/include -mmacosx-version-min=14-arm -mmacosx-version-min=11.0 -P -O0 -fpermissive -Werror=implicit-function-declaration 

Code:
 
        #ifdef __has_include
         #if !__has_include("version")
          #error "Header 'version' could not be found"
         #endif
        #else
         #include <version>
        #endif
Cached compiler stdout:
 

Cached compiler stderr:
 
Using cached compile:
Cached command line:  arm64-apple-darwin20.0.0-clang++ /Users/jenkins/j/workspace/release/tarball/eb40a89f6a/build/conda/envs/lsst-scipipe-12.1.0/share/eups/EupsBuildDir/Darwin/gauss2d_fit-g199a45376c+0658834863/gauss2d_fit-g199a45376c+0658834863/build-release/meson-private/tmpns_s6l_k/testfile.cpp -o /Users/jenkins/j/workspace/release/tarball/eb40a89f6a/build/conda/envs/lsst-scipipe-12.1.0/share/eups/EupsBuildDir/Darwin/gauss2d_fit-g199a45376c+0658834863/gauss2d_fit-g199a45376c+0658834863/build-release/meson-private/tmpns_s6l_k/output.obj -c -ftree-vectorize -fPIC -fstack-protector-strong -O2 -pipe -stdlib=libc++ -fvisibility-inlines-hidden -fmessage-length=0 -isystem /Users/jenkins/j/workspace/release/tarball/eb40a89f6a/build/conda/envs/lsst-scipipe-12.1.0/include -D_FORTIFY_SOURCE=2 -isystem /Users/jenkins/j/workspace/release/tarball/eb40a89f6a/build/conda/envs/lsst-scipipe-12.1.0/include -mmacosx-version-min=14-arm -mmacosx-version-min=11.0 -O0 -fpermissive -Werror=implicit-function-declaration -Werror=unknown-warning-option -Werror=unused-command-line-argument -Werror=ignored-optimization-argument 

Code:
 
        #include <version>
        int main(void) {
            /* If it's not defined as a macro, try to use as a symbol */
            #ifndef _LIBCPP_VERSION
                _LIBCPP_VERSION;
            #endif
            return 0;
        }
Cached compiler stdout:
 
Cached compiler stderr:
 
Using cached compile:
Cached command line:  arm64-apple-darwin20.0.0-clang++ /Users/jenkins/j/workspace/release/tarball/eb40a89f6a/build/conda/envs/lsst-scipipe-12.1.0/share/eups/EupsBuildDir/Darwin/gauss2d_fit-g199a45376c+0658834863/gauss2d_fit-g199a45376c+0658834863/build-release/meson-private/tmp5nwwh0eb/testfile.cpp -E -P -ftree-vectorize -fPIC -fstack-protector-strong -O2 -pipe -stdlib=libc++ -fvisibility-inlines-hidden -fmessage-length=0 -isystem /Users/jenkins/j/workspace/release/tarball/eb40a89f6a/build/conda/envs/lsst-scipipe-12.1.0/include -D_FORTIFY_SOURCE=2 -isystem /Users/jenkins/j/workspace/release/tarball/eb40a89f6a/build/conda/envs/lsst-scipipe-12.1.0/include -mmacosx-version-min=14-arm -mmacosx-version-min=11.0 -P -O0 -fpermissive -Werror=implicit-function-declaration 

Code:
 
        #ifdef __has_include
         #if !__has_include("version")
          #error "Header 'version' could not be found"
         #endif
        #else
         #include <version>
        #endif
Cached compiler stdout:
 

Cached compiler stderr:
 
Using cached compile:
Cached command line:  arm64-apple-darwin20.0.0-clang++ /Users/jenkins/j/workspace/release/tarball/eb40a89f6a/build/conda/envs/lsst-scipipe-12.1.0/share/eups/EupsBuildDir/Darwin/gauss2d_fit-g199a45376c+0658834863/gauss2d_fit-g199a45376c+0658834863/build-release/meson-private/tmpns_s6l_k/testfile.cpp -o /Users/jenkins/j/workspace/release/tarball/eb40a89f6a/build/conda/envs/lsst-scipipe-12.1.0/share/eups/EupsBuildDir/Darwin/gauss2d_fit-g199a45376c+0658834863/gauss2d_fit-g199a45376c+0658834863/build-release/meson-private/tmpns_s6l_k/output.obj -c -ftree-vectorize -fPIC -fstack-protector-strong -O2 -pipe -stdlib=libc++ -fvisibility-inlines-hidden -fmessage-length=0 -isystem /Users/jenkins/j/workspace/release/tarball/eb40a89f6a/build/conda/envs/lsst-scipipe-12.1.0/include -D_FORTIFY_SOURCE=2 -isystem /Users/jenkins/j/workspace/release/tarball/eb40a89f6a/build/conda/envs/lsst-scipipe-12.1.0/include -mmacosx-version-min=14-arm -mmacosx-version-min=11.0 -O0 -fpermissive -Werror=implicit-function-declaration -Werror=unknown-warning-option -Werror=unused-command-line-argument -Werror=ignored-optimization-argument 

Code:
 
        #include <version>
        int main(void) {
            /* If it's not defined as a macro, try to use as a symbol */
            #ifndef _LIBCPP_VERSION
                _LIBCPP_VERSION;
            #endif
            return 0;
        }
Cached compiler stdout:
 
Cached compiler stderr:
 
Using cached compile:
Cached command line:  arm64-apple-darwin20.0.0-clang++ /Users/jenkins/j/workspace/release/tarball/eb40a89f6a/build/conda/envs/lsst-scipipe-12.1.0/share/eups/EupsBuildDir/Darwin/gauss2d_fit-g199a45376c+0658834863/gauss2d_fit-g199a45376c+0658834863/build-release/meson-private/tmp5nwwh0eb/testfile.cpp -E -P -ftree-vectorize -fPIC -fstack-protector-strong -O2 -pipe -stdlib=libc++ -fvisibility-inlines-hidden -fmessage-length=0 -isystem /Users/jenkins/j/workspace/release/tarball/eb40a89f6a/build/conda/envs/lsst-scipipe-12.1.0/include -D_FORTIFY_SOURCE=2 -isystem /Users/jenkins/j/workspace/release/tarball/eb40a89f6a/build/conda/envs/lsst-scipipe-12.1.0/include -mmacosx-version-min=14-arm -mmacosx-version-min=11.0 -P -O0 -fpermissive -Werror=implicit-function-declaration 

Code:
 
        #ifdef __has_include
         #if !__has_include("version")
          #error "Header 'version' could not be found"
         #endif
        #else
         #include <version>
        #endif
Cached compiler stdout:
 

Cached compiler stderr:
 
Using cached compile:
Cached command line:  arm64-apple-darwin20.0.0-clang++ /Users/jenkins/j/workspace/release/tarball/eb40a89f6a/build/conda/envs/lsst-scipipe-12.1.0/share/eups/EupsBuildDir/Darwin/gauss2d_fit-g199a45376c+0658834863/gauss2d_fit-g199a45376c+0658834863/build-release/meson-private/tmpns_s6l_k/testfile.cpp -o /Users/jenkins/j/workspace/release/tarball/eb40a89f6a/build/conda/envs/lsst-scipipe-12.1.0/share/eups/EupsBuildDir/Darwin/gauss2d_fit-g199a45376c+0658834863/gauss2d_fit-g199a45376c+0658834863/build-release/meson-private/tmpns_s6l_k/output.obj -c -ftree-vectorize -fPIC -fstack-protector-strong -O2 -pipe -stdlib=libc++ -fvisibility-inlines-hidden -fmessage-length=0 -isystem /Users/jenkins/j/workspace/release/tarball/eb40a89f6a/build/conda/envs/lsst-scipipe-12.1.0/include -D_FORTIFY_SOURCE=2 -isystem /Users/jenkins/j/workspace/release/tarball/eb40a89f6a/build/conda/envs/lsst-scipipe-12.1.0/include -mmacosx-version-min=14-arm -mmacosx-version-min=11.0 -O0 -fpermissive -Werror=implicit-function-declaration -Werror=unknown-warning-option -Werror=unused-command-line-argument -Werror=ignored-optimization-argument 

Code:
 
        #include <version>
        int main(void) {
            /* If it's not defined as a macro, try to use as a symbol */
            #ifndef _LIBCPP_VERSION
                _LIBCPP_VERSION;
            #endif
            return 0;
        }
Cached compiler stdout:
 
Cached compiler stderr:
 
Using cached compile:
Cached command line:  arm64-apple-darwin20.0.0-clang++ /Users/jenkins/j/workspace/release/tarball/eb40a89f6a/build/conda/envs/lsst-scipipe-12.1.0/share/eups/EupsBuildDir/Darwin/gauss2d_fit-g199a45376c+0658834863/gauss2d_fit-g199a45376c+0658834863/build-release/meson-private/tmp5nwwh0eb/testfile.cpp -E -P -ftree-vectorize -fPIC -fstack-protector-strong -O2 -pipe -stdlib=libc++ -fvisibility-inlines-hidden -fmessage-length=0 -isystem /Users/jenkins/j/workspace/release/tarball/eb40a89f6a/build/conda/envs/lsst-scipipe-12.1.0/include -D_FORTIFY_SOURCE=2 -isystem /Users/jenkins/j/workspace/release/tarball/eb40a89f6a/build/conda/envs/lsst-scipipe-12.1.0/include -mmacosx-version-min=14-arm -mmacosx-version-min=11.0 -P -O0 -fpermissive -Werror=implicit-function-declaration 

Code:
 
        #ifdef __has_include
         #if !__has_include("version")
          #error "Header 'version' could not be found"
         #endif
        #else
         #include <version>
        #endif
Cached compiler stdout:
 

Cached compiler stderr:
 
Using cached compile:
Cached command line:  arm64-apple-darwin20.0.0-clang++ /Users/jenkins/j/workspace/release/tarball/eb40a89f6a/build/conda/envs/lsst-scipipe-12.1.0/share/eups/EupsBuildDir/Darwin/gauss2d_fit-g199a45376c+0658834863/gauss2d_fit-g199a45376c+0658834863/build-release/meson-private/tmpns_s6l_k/testfile.cpp -o /Users/jenkins/j/workspace/release/tarball/eb40a89f6a/build/conda/envs/lsst-scipipe-12.1.0/share/eups/EupsBuildDir/Darwin/gauss2d_fit-g199a45376c+0658834863/gauss2d_fit-g199a45376c+0658834863/build-release/meson-private/tmpns_s6l_k/output.obj -c -ftree-vectorize -fPIC -fstack-protector-strong -O2 -pipe -stdlib=libc++ -fvisibility-inlines-hidden -fmessage-length=0 -isystem /Users/jenkins/j/workspace/release/tarball/eb40a89f6a/build/conda/envs/lsst-scipipe-12.1.0/include -D_FORTIFY_SOURCE=2 -isystem /Users/jenkins/j/workspace/release/tarball/eb40a89f6a/build/conda/envs/lsst-scipipe-12.1.0/include -mmacosx-version-min=14-arm -mmacosx-version-min=11.0 -O0 -fpermissive -Werror=implicit-function-declaration -Werror=unknown-warning-option -Werror=unused-command-line-argument -Werror=ignored-optimization-argument 

Code:
 
        #include <version>
        int main(void) {
            /* If it's not defined as a macro, try to use as a symbol */
            #ifndef _LIBCPP_VERSION
                _LIBCPP_VERSION;
            #endif
            return 0;
        }
Cached compiler stdout:
 
Cached compiler stderr:
 
Using cached compile:
Cached command line:  arm64-apple-darwin20.0.0-clang++ /Users/jenkins/j/workspace/release/tarball/eb40a89f6a/build/conda/envs/lsst-scipipe-12.1.0/share/eups/EupsBuildDir/Darwin/gauss2d_fit-g199a45376c+0658834863/gauss2d_fit-g199a45376c+0658834863/build-release/meson-private/tmp5nwwh0eb/testfile.cpp -E -P -ftree-vectorize -fPIC -fstack-protector-strong -O2 -pipe -stdlib=libc++ -fvisibility-inlines-hidden -fmessage-length=0 -isystem /Users/jenkins/j/workspace/release/tarball/eb40a89f6a/build/conda/envs/lsst-scipipe-12.1.0/include -D_FORTIFY_SOURCE=2 -isystem /Users/jenkins/j/workspace/release/tarball/eb40a89f6a/build/conda/envs/lsst-scipipe-12.1.0/include -mmacosx-version-min=14-arm -mmacosx-version-min=11.0 -P -O0 -fpermissive -Werror=implicit-function-declaration 

Code:
 
        #ifdef __has_include
         #if !__has_include("version")
          #error "Header 'version' could not be found"
         #endif
        #else
         #include <version>
        #endif
Cached compiler stdout:
 

Cached compiler stderr:
 
Using cached compile:
Cached command line:  arm64-apple-darwin20.0.0-clang++ /Users/jenkins/j/workspace/release/tarball/eb40a89f6a/build/conda/envs/lsst-scipipe-12.1.0/share/eups/EupsBuildDir/Darwin/gauss2d_fit-g199a45376c+0658834863/gauss2d_fit-g199a45376c+0658834863/build-release/meson-private/tmpns_s6l_k/testfile.cpp -o /Users/jenkins/j/workspace/release/tarball/eb40a89f6a/build/conda/envs/lsst-scipipe-12.1.0/share/eups/EupsBuildDir/Darwin/gauss2d_fit-g199a45376c+0658834863/gauss2d_fit-g199a45376c+0658834863/build-release/meson-private/tmpns_s6l_k/output.obj -c -ftree-vectorize -fPIC -fstack-protector-strong -O2 -pipe -stdlib=libc++ -fvisibility-inlines-hidden -fmessage-length=0 -isystem /Users/jenkins/j/workspace/release/tarball/eb40a89f6a/build/conda/envs/lsst-scipipe-12.1.0/include -D_FORTIFY_SOURCE=2 -isystem /Users/jenkins/j/workspace/release/tarball/eb40a89f6a/build/conda/envs/lsst-scipipe-12.1.0/include -mmacosx-version-min=14-arm -mmacosx-version-min=11.0 -O0 -fpermissive -Werror=implicit-function-declaration -Werror=unknown-warning-option -Werror=unused-command-line-argument -Werror=ignored-optimization-argument 

Code:
 
        #include <version>
        int main(void) {
            /* If it's not defined as a macro, try to use as a symbol */
            #ifndef _LIBCPP_VERSION
                _LIBCPP_VERSION;
            #endif
            return 0;
        }
Cached compiler stdout:
 
Cached compiler stderr:
 
Using cached compile:
Cached command line:  arm64-apple-darwin20.0.0-clang++ /Users/jenkins/j/workspace/release/tarball/eb40a89f6a/build/conda/envs/lsst-scipipe-12.1.0/share/eups/EupsBuildDir/Darwin/gauss2d_fit-g199a45376c+0658834863/gauss2d_fit-g199a45376c+0658834863/build-release/meson-private/tmp5nwwh0eb/testfile.cpp -E -P -ftree-vectorize -fPIC -fstack-protector-strong -O2 -pipe -stdlib=libc++ -fvisibility-inlines-hidden -fmessage-length=0 -isystem /Users/jenkins/j/workspace/release/tarball/eb40a89f6a/build/conda/envs/lsst-scipipe-12.1.0/include -D_FORTIFY_SOURCE=2 -isystem /Users/jenkins/j/workspace/release/tarball/eb40a89f6a/build/conda/envs/lsst-scipipe-12.1.0/include -mmacosx-version-min=14-arm -mmacosx-version-min=11.0 -P -O0 -fpermissive -Werror=implicit-function-declaration 

Code:
 
        #ifdef __has_include
         #if !__has_include("version")
          #error "Header 'version' could not be found"
         #endif
        #else
         #include <version>
        #endif
Cached compiler stdout:
 

Cached compiler stderr:
 
Using cached compile:
Cached command line:  arm64-apple-darwin20.0.0-clang++ /Users/jenkins/j/workspace/release/tarball/eb40a89f6a/build/conda/envs/lsst-scipipe-12.1.0/share/eups/EupsBuildDir/Darwin/gauss2d_fit-g199a45376c+0658834863/gauss2d_fit-g199a45376c+0658834863/build-release/meson-private/tmpns_s6l_k/testfile.cpp -o /Users/jenkins/j/workspace/release/tarball/eb40a89f6a/build/conda/envs/lsst-scipipe-12.1.0/share/eups/EupsBuildDir/Darwin/gauss2d_fit-g199a45376c+0658834863/gauss2d_fit-g199a45376c+0658834863/build-release/meson-private/tmpns_s6l_k/output.obj -c -ftree-vectorize -fPIC -fstack-protector-strong -O2 -pipe -stdlib=libc++ -fvisibility-inlines-hidden -fmessage-length=0 -isystem /Users/jenkins/j/workspace/release/tarball/eb40a89f6a/build/conda/envs/lsst-scipipe-12.1.0/include -D_FORTIFY_SOURCE=2 -isystem /Users/jenkins/j/workspace/release/tarball/eb40a89f6a/build/conda/envs/lsst-scipipe-12.1.0/include -mmacosx-version-min=14-arm -mmacosx-version-min=11.0 -O0 -fpermissive -Werror=implicit-function-declaration -Werror=unknown-warning-option -Werror=unused-command-line-argument -Werror=ignored-optimization-argument 

Code:
 
        #include <version>
        int main(void) {
            /* If it's not defined as a macro, try to use as a symbol */
            #ifndef _LIBCPP_VERSION
                _LIBCPP_VERSION;
            #endif
            return 0;
        }
Cached compiler stdout:
 
Cached compiler stderr:
 
Using cached compile:
Cached command line:  arm64-apple-darwin20.0.0-clang++ /Users/jenkins/j/workspace/release/tarball/eb40a89f6a/build/conda/envs/lsst-scipipe-12.1.0/share/eups/EupsBuildDir/Darwin/gauss2d_fit-g199a45376c+0658834863/gauss2d_fit-g199a45376c+0658834863/build-release/meson-private/tmp5nwwh0eb/testfile.cpp -E -P -ftree-vectorize -fPIC -fstack-protector-strong -O2 -pipe -stdlib=libc++ -fvisibility-inlines-hidden -fmessage-length=0 -isystem /Users/jenkins/j/workspace/release/tarball/eb40a89f6a/build/conda/envs/lsst-scipipe-12.1.0/include -D_FORTIFY_SOURCE=2 -isystem /Users/jenkins/j/workspace/release/tarball/eb40a89f6a/build/conda/envs/lsst-scipipe-12.1.0/include -mmacosx-version-min=14-arm -mmacosx-version-min=11.0 -P -O0 -fpermissive -Werror=implicit-function-declaration 

Code:
 
        #ifdef __has_include
         #if !__has_include("version")
          #error "Header 'version' could not be found"
         #endif
        #else
         #include <version>
        #endif
Cached compiler stdout:
 

Cached compiler stderr:
 
Using cached compile:
Cached command line:  arm64-apple-darwin20.0.0-clang++ /Users/jenkins/j/workspace/release/tarball/eb40a89f6a/build/conda/envs/lsst-scipipe-12.1.0/share/eups/EupsBuildDir/Darwin/gauss2d_fit-g199a45376c+0658834863/gauss2d_fit-g199a45376c+0658834863/build-release/meson-private/tmpns_s6l_k/testfile.cpp -o /Users/jenkins/j/workspace/release/tarball/eb40a89f6a/build/conda/envs/lsst-scipipe-12.1.0/share/eups/EupsBuildDir/Darwin/gauss2d_fit-g199a45376c+0658834863/gauss2d_fit-g199a45376c+0658834863/build-release/meson-private/tmpns_s6l_k/output.obj -c -ftree-vectorize -fPIC -fstack-protector-strong -O2 -pipe -stdlib=libc++ -fvisibility-inlines-hidden -fmessage-length=0 -isystem /Users/jenkins/j/workspace/release/tarball/eb40a89f6a/build/conda/envs/lsst-scipipe-12.1.0/include -D_FORTIFY_SOURCE=2 -isystem /Users/jenkins/j/workspace/release/tarball/eb40a89f6a/build/conda/envs/lsst-scipipe-12.1.0/include -mmacosx-version-min=14-arm -mmacosx-version-min=11.0 -O0 -fpermissive -Werror=implicit-function-declaration -Werror=unknown-warning-option -Werror=unused-command-line-argument -Werror=ignored-optimization-argument 

Code:
 
        #include <version>
        int main(void) {
            /* If it's not defined as a macro, try to use as a symbol */
            #ifndef _LIBCPP_VERSION
                _LIBCPP_VERSION;
            #endif
            return 0;
        }
Cached compiler stdout:
 
Cached compiler stderr:
 
Using cached compile:
Cached command line:  arm64-apple-darwin20.0.0-clang++ /Users/jenkins/j/workspace/release/tarball/eb40a89f6a/build/conda/envs/lsst-scipipe-12.1.0/share/eups/EupsBuildDir/Darwin/gauss2d_fit-g199a45376c+0658834863/gauss2d_fit-g199a45376c+0658834863/build-release/meson-private/tmp5nwwh0eb/testfile.cpp -E -P -ftree-vectorize -fPIC -fstack-protector-strong -O2 -pipe -stdlib=libc++ -fvisibility-inlines-hidden -fmessage-length=0 -isystem /Users/jenkins/j/workspace/release/tarball/eb40a89f6a/build/conda/envs/lsst-scipipe-12.1.0/include -D_FORTIFY_SOURCE=2 -isystem /Users/jenkins/j/workspace/release/tarball/eb40a89f6a/build/conda/envs/lsst-scipipe-12.1.0/include -mmacosx-version-min=14-arm -mmacosx-version-min=11.0 -P -O0 -fpermissive -Werror=implicit-function-declaration 

Code:
 
        #ifdef __has_include
         #if !__has_include("version")
          #error "Header 'version' could not be found"
         #endif
        #else
         #include <version>
        #endif
Cached compiler stdout:
 

Cached compiler stderr:
 
Using cached compile:
Cached command line:  arm64-apple-darwin20.0.0-clang++ /Users/jenkins/j/workspace/release/tarball/eb40a89f6a/build/conda/envs/lsst-scipipe-12.1.0/share/eups/EupsBuildDir/Darwin/gauss2d_fit-g199a45376c+0658834863/gauss2d_fit-g199a45376c+0658834863/build-release/meson-private/tmpns_s6l_k/testfile.cpp -o /Users/jenkins/j/workspace/release/tarball/eb40a89f6a/build/conda/envs/lsst-scipipe-12.1.0/share/eups/EupsBuildDir/Darwin/gauss2d_fit-g199a45376c+0658834863/gauss2d_fit-g199a45376c+0658834863/build-release/meson-private/tmpns_s6l_k/output.obj -c -ftree-vectorize -fPIC -fstack-protector-strong -O2 -pipe -stdlib=libc++ -fvisibility-inlines-hidden -fmessage-length=0 -isystem /Users/jenkins/j/workspace/release/tarball/eb40a89f6a/build/conda/envs/lsst-scipipe-12.1.0/include -D_FORTIFY_SOURCE=2 -isystem /Users/jenkins/j/workspace/release/tarball/eb40a89f6a/build/conda/envs/lsst-scipipe-12.1.0/include -mmacosx-version-min=14-arm -mmacosx-version-min=11.0 -O0 -fpermissive -Werror=implicit-function-declaration -Werror=unknown-warning-option -Werror=unused-command-line-argument -Werror=ignored-optimization-argument 

Code:
 
        #include <version>
        int main(void) {
            /* If it's not defined as a macro, try to use as a symbol */
            #ifndef _LIBCPP_VERSION
                _LIBCPP_VERSION;
            #endif
            return 0;
        }
Cached compiler stdout:
 
Cached compiler stderr:
 
Using cached compile:
Cached command line:  arm64-apple-darwin20.0.0-clang++ /Users/jenkins/j/workspace/release/tarball/eb40a89f6a/build/conda/envs/lsst-scipipe-12.1.0/share/eups/EupsBuildDir/Darwin/gauss2d_fit-g199a45376c+0658834863/gauss2d_fit-g199a45376c+0658834863/build-release/meson-private/tmp5nwwh0eb/testfile.cpp -E -P -ftree-vectorize -fPIC -fstack-protector-strong -O2 -pipe -stdlib=libc++ -fvisibility-inlines-hidden -fmessage-length=0 -isystem /Users/jenkins/j/workspace/release/tarball/eb40a89f6a/build/conda/envs/lsst-scipipe-12.1.0/include -D_FORTIFY_SOURCE=2 -isystem /Users/jenkins/j/workspace/release/tarball/eb40a89f6a/build/conda/envs/lsst-scipipe-12.1.0/include -mmacosx-version-min=14-arm -mmacosx-version-min=11.0 -P -O0 -fpermissive -Werror=implicit-function-declaration 

Code:
 
        #ifdef __has_include
         #if !__has_include("version")
          #error "Header 'version' could not be found"
         #endif
        #else
         #include <version>
        #endif
Cached compiler stdout:
 

Cached compiler stderr:
 
Using cached compile:
Cached command line:  arm64-apple-darwin20.0.0-clang++ /Users/jenkins/j/workspace/release/tarball/eb40a89f6a/build/conda/envs/lsst-scipipe-12.1.0/share/eups/EupsBuildDir/Darwin/gauss2d_fit-g199a45376c+0658834863/gauss2d_fit-g199a45376c+0658834863/build-release/meson-private/tmpns_s6l_k/testfile.cpp -o /Users/jenkins/j/workspace/release/tarball/eb40a89f6a/build/conda/envs/lsst-scipipe-12.1.0/share/eups/EupsBuildDir/Darwin/gauss2d_fit-g199a45376c+0658834863/gauss2d_fit-g199a45376c+0658834863/build-release/meson-private/tmpns_s6l_k/output.obj -c -ftree-vectorize -fPIC -fstack-protector-strong -O2 -pipe -stdlib=libc++ -fvisibility-inlines-hidden -fmessage-length=0 -isystem /Users/jenkins/j/workspace/release/tarball/eb40a89f6a/build/conda/envs/lsst-scipipe-12.1.0/include -D_FORTIFY_SOURCE=2 -isystem /Users/jenkins/j/workspace/release/tarball/eb40a89f6a/build/conda/envs/lsst-scipipe-12.1.0/include -mmacosx-version-min=14-arm -mmacosx-version-min=11.0 -O0 -fpermissive -Werror=implicit-function-declaration -Werror=unknown-warning-option -Werror=unused-command-line-argument -Werror=ignored-optimization-argument 

Code:
 
        #include <version>
        int main(void) {
            /* If it's not defined as a macro, try to use as a symbol */
            #ifndef _LIBCPP_VERSION
                _LIBCPP_VERSION;
            #endif
            return 0;
        }
Cached compiler stdout:
 
Cached compiler stderr:
 
Using cached compile:
Cached command line:  arm64-apple-darwin20.0.0-clang++ /Users/jenkins/j/workspace/release/tarball/eb40a89f6a/build/conda/envs/lsst-scipipe-12.1.0/share/eups/EupsBuildDir/Darwin/gauss2d_fit-g199a45376c+0658834863/gauss2d_fit-g199a45376c+0658834863/build-release/meson-private/tmp5nwwh0eb/testfile.cpp -E -P -ftree-vectorize -fPIC -fstack-protector-strong -O2 -pipe -stdlib=libc++ -fvisibility-inlines-hidden -fmessage-length=0 -isystem /Users/jenkins/j/workspace/release/tarball/eb40a89f6a/build/conda/envs/lsst-scipipe-12.1.0/include -D_FORTIFY_SOURCE=2 -isystem /Users/jenkins/j/workspace/release/tarball/eb40a89f6a/build/conda/envs/lsst-scipipe-12.1.0/include -mmacosx-version-min=14-arm -mmacosx-version-min=11.0 -P -O0 -fpermissive -Werror=implicit-function-declaration 

Code:
 
        #ifdef __has_include
         #if !__has_include("version")
          #error "Header 'version' could not be found"
         #endif
        #else
         #include <version>
        #endif
Cached compiler stdout:
 

Cached compiler stderr:
 
Using cached compile:
Cached command line:  arm64-apple-darwin20.0.0-clang++ /Users/jenkins/j/workspace/release/tarball/eb40a89f6a/build/conda/envs/lsst-scipipe-12.1.0/share/eups/EupsBuildDir/Darwin/gauss2d_fit-g199a45376c+0658834863/gauss2d_fit-g199a45376c+0658834863/build-release/meson-private/tmpns_s6l_k/testfile.cpp -o /Users/jenkins/j/workspace/release/tarball/eb40a89f6a/build/conda/envs/lsst-scipipe-12.1.0/share/eups/EupsBuildDir/Darwin/gauss2d_fit-g199a45376c+0658834863/gauss2d_fit-g199a45376c+0658834863/build-release/meson-private/tmpns_s6l_k/output.obj -c -ftree-vectorize -fPIC -fstack-protector-strong -O2 -pipe -stdlib=libc++ -fvisibility-inlines-hidden -fmessage-length=0 -isystem /Users/jenkins/j/workspace/release/tarball/eb40a89f6a/build/conda/envs/lsst-scipipe-12.1.0/include -D_FORTIFY_SOURCE=2 -isystem /Users/jenkins/j/workspace/release/tarball/eb40a89f6a/build/conda/envs/lsst-scipipe-12.1.0/include -mmacosx-version-min=14-arm -mmacosx-version-min=11.0 -O0 -fpermissive -Werror=implicit-function-declaration -Werror=unknown-warning-option -Werror=unused-command-line-argument -Werror=ignored-optimization-argument 

Code:
 
        #include <version>
        int main(void) {
            /* If it's not defined as a macro, try to use as a symbol */
            #ifndef _LIBCPP_VERSION
                _LIBCPP_VERSION;
            #endif
            return 0;
        }
Cached compiler stdout:
 
Cached compiler stderr:
 
Using cached compile:
Cached command line:  arm64-apple-darwin20.0.0-clang++ /Users/jenkins/j/workspace/release/tarball/eb40a89f6a/build/conda/envs/lsst-scipipe-12.1.0/share/eups/EupsBuildDir/Darwin/gauss2d_fit-g199a45376c+0658834863/gauss2d_fit-g199a45376c+0658834863/build-release/meson-private/tmp5nwwh0eb/testfile.cpp -E -P -ftree-vectorize -fPIC -fstack-protector-strong -O2 -pipe -stdlib=libc++ -fvisibility-inlines-hidden -fmessage-length=0 -isystem /Users/jenkins/j/workspace/release/tarball/eb40a89f6a/build/conda/envs/lsst-scipipe-12.1.0/include -D_FORTIFY_SOURCE=2 -isystem /Users/jenkins/j/workspace/release/tarball/eb40a89f6a/build/conda/envs/lsst-scipipe-12.1.0/include -mmacosx-version-min=14-arm -mmacosx-version-min=11.0 -P -O0 -fpermissive -Werror=implicit-function-declaration 

Code:
 
        #ifdef __has_include
         #if !__has_include("version")
          #error "Header 'version' could not be found"
         #endif
        #else
         #include <version>
        #endif
Cached compiler stdout:
 

Cached compiler stderr:
 
Using cached compile:
Cached command line:  arm64-apple-darwin20.0.0-clang++ /Users/jenkins/j/workspace/release/tarball/eb40a89f6a/build/conda/envs/lsst-scipipe-12.1.0/share/eups/EupsBuildDir/Darwin/gauss2d_fit-g199a45376c+0658834863/gauss2d_fit-g199a45376c+0658834863/build-release/meson-private/tmpns_s6l_k/testfile.cpp -o /Users/jenkins/j/workspace/release/tarball/eb40a89f6a/build/conda/envs/lsst-scipipe-12.1.0/share/eups/EupsBuildDir/Darwin/gauss2d_fit-g199a45376c+0658834863/gauss2d_fit-g199a45376c+0658834863/build-release/meson-private/tmpns_s6l_k/output.obj -c -ftree-vectorize -fPIC -fstack-protector-strong -O2 -pipe -stdlib=libc++ -fvisibility-inlines-hidden -fmessage-length=0 -isystem /Users/jenkins/j/workspace/release/tarball/eb40a89f6a/build/conda/envs/lsst-scipipe-12.1.0/include -D_FORTIFY_SOURCE=2 -isystem /Users/jenkins/j/workspace/release/tarball/eb40a89f6a/build/conda/envs/lsst-scipipe-12.1.0/include -mmacosx-version-min=14-arm -mmacosx-version-min=11.0 -O0 -fpermissive -Werror=implicit-function-declaration -Werror=unknown-warning-option -Werror=unused-command-line-argument -Werror=ignored-optimization-argument 

Code:
 
        #include <version>
        int main(void) {
            /* If it's not defined as a macro, try to use as a symbol */
            #ifndef _LIBCPP_VERSION
                _LIBCPP_VERSION;
            #endif
            return 0;
        }
Cached compiler stdout:
 
Cached compiler stderr:
 
Using cached compile:
Cached command line:  arm64-apple-darwin20.0.0-clang++ /Users/jenkins/j/workspace/release/tarball/eb40a89f6a/build/conda/envs/lsst-scipipe-12.1.0/share/eups/EupsBuildDir/Darwin/gauss2d_fit-g199a45376c+0658834863/gauss2d_fit-g199a45376c+0658834863/build-release/meson-private/tmp5nwwh0eb/testfile.cpp -E -P -ftree-vectorize -fPIC -fstack-protector-strong -O2 -pipe -stdlib=libc++ -fvisibility-inlines-hidden -fmessage-length=0 -isystem /Users/jenkins/j/workspace/release/tarball/eb40a89f6a/build/conda/envs/lsst-scipipe-12.1.0/include -D_FORTIFY_SOURCE=2 -isystem /Users/jenkins/j/workspace/release/tarball/eb40a89f6a/build/conda/envs/lsst-scipipe-12.1.0/include -mmacosx-version-min=14-arm -mmacosx-version-min=11.0 -P -O0 -fpermissive -Werror=implicit-function-declaration 

Code:
 
        #ifdef __has_include
         #if !__has_include("version")
          #error "Header 'version' could not be found"
         #endif
        #else
         #include <version>
        #endif
Cached compiler stdout:
 

Cached compiler stderr:
 
Using cached compile:
Cached command line:  arm64-apple-darwin20.0.0-clang++ /Users/jenkins/j/workspace/release/tarball/eb40a89f6a/build/conda/envs/lsst-scipipe-12.1.0/share/eups/EupsBuildDir/Darwin/gauss2d_fit-g199a45376c+0658834863/gauss2d_fit-g199a45376c+0658834863/build-release/meson-private/tmpns_s6l_k/testfile.cpp -o /Users/jenkins/j/workspace/release/tarball/eb40a89f6a/build/conda/envs/lsst-scipipe-12.1.0/share/eups/EupsBuildDir/Darwin/gauss2d_fit-g199a45376c+0658834863/gauss2d_fit-g199a45376c+0658834863/build-release/meson-private/tmpns_s6l_k/output.obj -c -ftree-vectorize -fPIC -fstack-protector-strong -O2 -pipe -stdlib=libc++ -fvisibility-inlines-hidden -fmessage-length=0 -isystem /Users/jenkins/j/workspace/release/tarball/eb40a89f6a/build/conda/envs/lsst-scipipe-12.1.0/include -D_FORTIFY_SOURCE=2 -isystem /Users/jenkins/j/workspace/release/tarball/eb40a89f6a/build/conda/envs/lsst-scipipe-12.1.0/include -mmacosx-version-min=14-arm -mmacosx-version-min=11.0 -O0 -fpermissive -Werror=implicit-function-declaration -Werror=unknown-warning-option -Werror=unused-command-line-argument -Werror=ignored-optimization-argument 

Code:
 
        #include <version>
        int main(void) {
            /* If it's not defined as a macro, try to use as a symbol */
            #ifndef _LIBCPP_VERSION
                _LIBCPP_VERSION;
            #endif
            return 0;
        }
Cached compiler stdout:
 
Cached compiler stderr:
 
Using cached compile:
Cached command line:  arm64-apple-darwin20.0.0-clang++ /Users/jenkins/j/workspace/release/tarball/eb40a89f6a/build/conda/envs/lsst-scipipe-12.1.0/share/eups/EupsBuildDir/Darwin/gauss2d_fit-g199a45376c+0658834863/gauss2d_fit-g199a45376c+0658834863/build-release/meson-private/tmp5nwwh0eb/testfile.cpp -E -P -ftree-vectorize -fPIC -fstack-protector-strong -O2 -pipe -stdlib=libc++ -fvisibility-inlines-hidden -fmessage-length=0 -isystem /Users/jenkins/j/workspace/release/tarball/eb40a89f6a/build/conda/envs/lsst-scipipe-12.1.0/include -D_FORTIFY_SOURCE=2 -isystem /Users/jenkins/j/workspace/release/tarball/eb40a89f6a/build/conda/envs/lsst-scipipe-12.1.0/include -mmacosx-version-min=14-arm -mmacosx-version-min=11.0 -P -O0 -fpermissive -Werror=implicit-function-declaration 

Code:
 
        #ifdef __has_include
         #if !__has_include("version")
          #error "Header 'version' could not be found"
         #endif
        #else
         #include <version>
        #endif
Cached compiler stdout:
 

Cached compiler stderr:
 
Using cached compile:
Cached command line:  arm64-apple-darwin20.0.0-clang++ /Users/jenkins/j/workspace/release/tarball/eb40a89f6a/build/conda/envs/lsst-scipipe-12.1.0/share/eups/EupsBuildDir/Darwin/gauss2d_fit-g199a45376c+0658834863/gauss2d_fit-g199a45376c+0658834863/build-release/meson-private/tmpns_s6l_k/testfile.cpp -o /Users/jenkins/j/workspace/release/tarball/eb40a89f6a/build/conda/envs/lsst-scipipe-12.1.0/share/eups/EupsBuildDir/Darwin/gauss2d_fit-g199a45376c+0658834863/gauss2d_fit-g199a45376c+0658834863/build-release/meson-private/tmpns_s6l_k/output.obj -c -ftree-vectorize -fPIC -fstack-protector-strong -O2 -pipe -stdlib=libc++ -fvisibility-inlines-hidden -fmessage-length=0 -isystem /Users/jenkins/j/workspace/release/tarball/eb40a89f6a/build/conda/envs/lsst-scipipe-12.1.0/include -D_FORTIFY_SOURCE=2 -isystem /Users/jenkins/j/workspace/release/tarball/eb40a89f6a/build/conda/envs/lsst-scipipe-12.1.0/include -mmacosx-version-min=14-arm -mmacosx-version-min=11.0 -O0 -fpermissive -Werror=implicit-function-declaration -Werror=unknown-warning-option -Werror=unused-command-line-argument -Werror=ignored-optimization-argument 

Code:
 
        #include <version>
        int main(void) {
            /* If it's not defined as a macro, try to use as a symbol */
            #ifndef _LIBCPP_VERSION
                _LIBCPP_VERSION;
            #endif
            return 0;
        }
Cached compiler stdout:
 
Cached compiler stderr:
 
Using cached compile:
Cached command line:  arm64-apple-darwin20.0.0-clang++ /Users/jenkins/j/workspace/release/tarball/eb40a89f6a/build/conda/envs/lsst-scipipe-12.1.0/share/eups/EupsBuildDir/Darwin/gauss2d_fit-g199a45376c+0658834863/gauss2d_fit-g199a45376c+0658834863/build-release/meson-private/tmp5nwwh0eb/testfile.cpp -E -P -ftree-vectorize -fPIC -fstack-protector-strong -O2 -pipe -stdlib=libc++ -fvisibility-inlines-hidden -fmessage-length=0 -isystem /Users/jenkins/j/workspace/release/tarball/eb40a89f6a/build/conda/envs/lsst-scipipe-12.1.0/include -D_FORTIFY_SOURCE=2 -isystem /Users/jenkins/j/workspace/release/tarball/eb40a89f6a/build/conda/envs/lsst-scipipe-12.1.0/include -mmacosx-version-min=14-arm -mmacosx-version-min=11.0 -P -O0 -fpermissive -Werror=implicit-function-declaration 

Code:
 
        #ifdef __has_include
         #if !__has_include("version")
          #error "Header 'version' could not be found"
         #endif
        #else
         #include <version>
        #endif
Cached compiler stdout:
 

Cached compiler stderr:
 
Using cached compile:
Cached command line:  arm64-apple-darwin20.0.0-clang++ /Users/jenkins/j/workspace/release/tarball/eb40a89f6a/build/conda/envs/lsst-scipipe-12.1.0/share/eups/EupsBuildDir/Darwin/gauss2d_fit-g199a45376c+0658834863/gauss2d_fit-g199a45376c+0658834863/build-release/meson-private/tmpns_s6l_k/testfile.cpp -o /Users/jenkins/j/workspace/release/tarball/eb40a89f6a/build/conda/envs/lsst-scipipe-12.1.0/share/eups/EupsBuildDir/Darwin/gauss2d_fit-g199a45376c+0658834863/gauss2d_fit-g199a45376c+0658834863/build-release/meson-private/tmpns_s6l_k/output.obj -c -ftree-vectorize -fPIC -fstack-protector-strong -O2 -pipe -stdlib=libc++ -fvisibility-inlines-hidden -fmessage-length=0 -isystem /Users/jenkins/j/workspace/release/tarball/eb40a89f6a/build/conda/envs/lsst-scipipe-12.1.0/include -D_FORTIFY_SOURCE=2 -isystem /Users/jenkins/j/workspace/release/tarball/eb40a89f6a/build/conda/envs/lsst-scipipe-12.1.0/include -mmacosx-version-min=14-arm -mmacosx-version-min=11.0 -O0 -fpermissive -Werror=implicit-function-declaration -Werror=unknown-warning-option -Werror=unused-command-line-argument -Werror=ignored-optimization-argument 

Code:
 
        #include <version>
        int main(void) {
            /* If it's not defined as a macro, try to use as a symbol */
            #ifndef _LIBCPP_VERSION
                _LIBCPP_VERSION;
            #endif
            return 0;
        }
Cached compiler stdout:
 
Cached compiler stderr:
 
!meson_ci!/ci_include "/Users/jenkins/j/workspace/release/tarball/eb40a89f6a/build/conda/envs/lsst-scipipe-12.1.0/share/eups/EupsBuildDir/Darwin/gauss2d_fit-g199a45376c+0658834863/gauss2d_fit-g199a45376c+0658834863/build-release/build.ninja"
