Build started at 2026-03-05T01:41:09.452784
Main binary: /Users/jenkins/j/workspace/release/tarball/eb40a89f6a/build/conda/envs/lsst-scipipe-12.1.0/bin/python3.13
Build Options: -Dprefix=/Users/jenkins/j/workspace/release/tarball/eb40a89f6a/build/conda/envs/lsst-scipipe-12.1.0/share/eups/EupsBuildDir/Darwin/gauss2d-gbf99507273+fd8379166f/gauss2d-gbf99507273+fd8379166f/build-release -Dlibdir=lib -Dbuildtype=release
Python system: Darwin
The Meson build system
Version: 1.10.1
Source dir: /Users/jenkins/j/workspace/release/tarball/eb40a89f6a/build/conda/envs/lsst-scipipe-12.1.0/share/eups/EupsBuildDir/Darwin/gauss2d-gbf99507273+fd8379166f/gauss2d-gbf99507273+fd8379166f
Build dir: /Users/jenkins/j/workspace/release/tarball/eb40a89f6a/build/conda/envs/lsst-scipipe-12.1.0/share/eups/EupsBuildDir/Darwin/gauss2d-gbf99507273+fd8379166f/gauss2d-gbf99507273+fd8379166f/build-release
Build type: native build
Project name: libgauss2d
Project version: 0.3.0
-----------
Detecting compiler via: `arm64-apple-darwin20.0.0-clang++ --version` -> 0
stdout:
clang version 19.1.7
Target: arm64-apple-darwin20.0.0
Thread model: posix
InstalledDir: /Users/jenkins/j/workspace/release/tarball/eb40a89f6a/build/conda/envs/lsst-scipipe-12.1.0/bin
-----------
Running command: -x c++ -E -dM -
-----
-----------
Detecting linker via: `arm64-apple-darwin20.0.0-clang++ -Wl,--version -Wl,-headerpad_max_install_names -Wl,-dead_strip_dylibs -Wl,-rpath,/Users/jenkins/j/workspace/release/tarball/eb40a89f6a/build/conda/envs/lsst-scipipe-12.1.0/lib -L/Users/jenkins/j/workspace/release/tarball/eb40a89f6a/build/conda/envs/lsst-scipipe-12.1.0/lib -ftree-vectorize -fPIC -fstack-protector-strong -O2 -pipe -stdlib=libc++ -fvisibility-inlines-hidden -fmessage-length=0 -isystem /Users/jenkins/j/workspace/release/tarball/eb40a89f6a/build/conda/envs/lsst-scipipe-12.1.0/include -D_FORTIFY_SOURCE=2 -isystem /Users/jenkins/j/workspace/release/tarball/eb40a89f6a/build/conda/envs/lsst-scipipe-12.1.0/include -mmacosx-version-min=14-arm -mmacosx-version-min=11.0` -> 1
stderr:
ld: unknown option: --version
arm64-apple-darwin20.0: error: linker command failed with exit code 1 (use -v to see invocation)
-----------
-----------
Detecting Apple linker via: `arm64-apple-darwin20.0.0-clang++ -Wl,-v -Wl,-headerpad_max_install_names -Wl,-dead_strip_dylibs -Wl,-rpath,/Users/jenkins/j/workspace/release/tarball/eb40a89f6a/build/conda/envs/lsst-scipipe-12.1.0/lib -L/Users/jenkins/j/workspace/release/tarball/eb40a89f6a/build/conda/envs/lsst-scipipe-12.1.0/lib -ftree-vectorize -fPIC -fstack-protector-strong -O2 -pipe -stdlib=libc++ -fvisibility-inlines-hidden -fmessage-length=0 -isystem /Users/jenkins/j/workspace/release/tarball/eb40a89f6a/build/conda/envs/lsst-scipipe-12.1.0/include -D_FORTIFY_SOURCE=2 -isystem /Users/jenkins/j/workspace/release/tarball/eb40a89f6a/build/conda/envs/lsst-scipipe-12.1.0/include -mmacosx-version-min=14-arm -mmacosx-version-min=11.0` -> 1
stderr:
@(#)PROGRAM:ld  PROJECT:ld64-956.6
BUILD 19:57:54 Jan 19 2026
configured to support archs: armv6 armv7 armv7s arm64 arm64e arm64_32 i386 x86_64 x86_64h armv6m armv7k armv7m armv7em riscv32 (tvOS)
Library search paths:
	/Users/jenkins/j/workspace/release/tarball/eb40a89f6a/build/conda/envs/lsst-scipipe-12.1.0/lib
	/Library/Developer/CommandLineTools/SDKs/MacOSX.sdk/usr/lib
Framework search paths:
	/Library/Developer/CommandLineTools/SDKs/MacOSX.sdk/System/Library/Frameworks/
Undefined symbols for architecture arm64:
  "_main", referenced from:
     implicit entry/start for main executable
ld: symbol(s) not found for architecture arm64
arm64-apple-darwin20.0: error: linker command failed with exit code 1 (use -v to see invocation)
-----------
Sanity testing C++ compiler: arm64-apple-darwin20.0.0-clang++
Is cross compiler: False.
Sanity check compiler command line: arm64-apple-darwin20.0.0-clang++ sanitycheckcpp.cc -o sanitycheckcpp.exe -ftree-vectorize -fPIC -fstack-protector-strong -O2 -pipe -stdlib=libc++ -fvisibility-inlines-hidden -fmessage-length=0 -isystem /Users/jenkins/j/workspace/release/tarball/eb40a89f6a/build/conda/envs/lsst-scipipe-12.1.0/include -D_FORTIFY_SOURCE=2 -isystem /Users/jenkins/j/workspace/release/tarball/eb40a89f6a/build/conda/envs/lsst-scipipe-12.1.0/include -mmacosx-version-min=14-arm -mmacosx-version-min=11.0 -Wl,-headerpad_max_install_names -Wl,-dead_strip_dylibs -Wl,-rpath,/Users/jenkins/j/workspace/release/tarball/eb40a89f6a/build/conda/envs/lsst-scipipe-12.1.0/lib -L/Users/jenkins/j/workspace/release/tarball/eb40a89f6a/build/conda/envs/lsst-scipipe-12.1.0/lib
Sanity check compile stdout:

-----
Sanity check compile stderr:

-----
Running test binary command:  /Users/jenkins/j/workspace/release/tarball/eb40a89f6a/build/conda/envs/lsst-scipipe-12.1.0/share/eups/EupsBuildDir/Darwin/gauss2d-gbf99507273+fd8379166f/gauss2d-gbf99507273+fd8379166f/build-release/meson-private/sanitycheckcpp.exe
-----------
Sanity check: `/Users/jenkins/j/workspace/release/tarball/eb40a89f6a/build/conda/envs/lsst-scipipe-12.1.0/share/eups/EupsBuildDir/Darwin/gauss2d-gbf99507273+fd8379166f/gauss2d-gbf99507273+fd8379166f/build-release/meson-private/sanitycheckcpp.exe` -> 0
C++ compiler for the host machine: arm64-apple-darwin20.0.0-clang++ (clang 19.1.7 "clang version 19.1.7")
C++ linker for the host machine: arm64-apple-darwin20.0.0-clang++ ld64 956.6
-----------
Detecting archiver via: `arm64-apple-darwin20.0.0-ar --version` -> 1
stderr:
usage:  ar -d [-TLsv] archive file ...
	ar -m [-TLsv] archive file ...
	ar -m [-abiTLsv] position archive file ...
	ar -p [-TLsv] archive [file ...]
	ar -q [-cTLsv] archive file ...
	ar -r [-cuTLsv] archive file ...
	ar -r [-abciuTLsv] position archive file ...
	ar -t [-TLsv] archive [file ...]
	ar -x [-ouTLsv] archive [file ...]
-----------
-----------
Detecting compiler via: `arm64-apple-darwin20.0.0-clang++ --version` -> 0
stdout:
clang version 19.1.7
Target: arm64-apple-darwin20.0.0
Thread model: posix
InstalledDir: /Users/jenkins/j/workspace/release/tarball/eb40a89f6a/build/conda/envs/lsst-scipipe-12.1.0/bin
-----------
Running command: -x c++ -E -dM -
-----
-----------
Detecting linker via: `arm64-apple-darwin20.0.0-clang++ -Wl,--version -Wl,-headerpad_max_install_names -Wl,-dead_strip_dylibs -Wl,-rpath,/Users/jenkins/j/workspace/release/tarball/eb40a89f6a/build/conda/envs/lsst-scipipe-12.1.0/lib -L/Users/jenkins/j/workspace/release/tarball/eb40a89f6a/build/conda/envs/lsst-scipipe-12.1.0/lib -ftree-vectorize -fPIC -fstack-protector-strong -O2 -pipe -stdlib=libc++ -fvisibility-inlines-hidden -fmessage-length=0 -isystem /Users/jenkins/j/workspace/release/tarball/eb40a89f6a/build/conda/envs/lsst-scipipe-12.1.0/include -D_FORTIFY_SOURCE=2 -isystem /Users/jenkins/j/workspace/release/tarball/eb40a89f6a/build/conda/envs/lsst-scipipe-12.1.0/include -mmacosx-version-min=14-arm -mmacosx-version-min=11.0` -> 1
stderr:
ld: unknown option: --version
arm64-apple-darwin20.0: error: linker command failed with exit code 1 (use -v to see invocation)
-----------
-----------
Detecting Apple linker via: `arm64-apple-darwin20.0.0-clang++ -Wl,-v -Wl,-headerpad_max_install_names -Wl,-dead_strip_dylibs -Wl,-rpath,/Users/jenkins/j/workspace/release/tarball/eb40a89f6a/build/conda/envs/lsst-scipipe-12.1.0/lib -L/Users/jenkins/j/workspace/release/tarball/eb40a89f6a/build/conda/envs/lsst-scipipe-12.1.0/lib -ftree-vectorize -fPIC -fstack-protector-strong -O2 -pipe -stdlib=libc++ -fvisibility-inlines-hidden -fmessage-length=0 -isystem /Users/jenkins/j/workspace/release/tarball/eb40a89f6a/build/conda/envs/lsst-scipipe-12.1.0/include -D_FORTIFY_SOURCE=2 -isystem /Users/jenkins/j/workspace/release/tarball/eb40a89f6a/build/conda/envs/lsst-scipipe-12.1.0/include -mmacosx-version-min=14-arm -mmacosx-version-min=11.0` -> 1
stderr:
@(#)PROGRAM:ld  PROJECT:ld64-956.6
BUILD 19:57:54 Jan 19 2026
configured to support archs: armv6 armv7 armv7s arm64 arm64e arm64_32 i386 x86_64 x86_64h armv6m armv7k armv7m armv7em riscv32 (tvOS)
Library search paths:
	/Users/jenkins/j/workspace/release/tarball/eb40a89f6a/build/conda/envs/lsst-scipipe-12.1.0/lib
	/Library/Developer/CommandLineTools/SDKs/MacOSX.sdk/usr/lib
Framework search paths:
	/Library/Developer/CommandLineTools/SDKs/MacOSX.sdk/System/Library/Frameworks/
Undefined symbols for architecture arm64:
  "_main", referenced from:
     implicit entry/start for main executable
ld: symbol(s) not found for architecture arm64
arm64-apple-darwin20.0: error: linker command failed with exit code 1 (use -v to see invocation)
-----------
Sanity testing C++ compiler: arm64-apple-darwin20.0.0-clang++
Is cross compiler: False.
Sanity check compiler command line: arm64-apple-darwin20.0.0-clang++ sanitycheckcpp.cc -o sanitycheckcpp.exe -ftree-vectorize -fPIC -fstack-protector-strong -O2 -pipe -stdlib=libc++ -fvisibility-inlines-hidden -fmessage-length=0 -isystem /Users/jenkins/j/workspace/release/tarball/eb40a89f6a/build/conda/envs/lsst-scipipe-12.1.0/include -D_FORTIFY_SOURCE=2 -isystem /Users/jenkins/j/workspace/release/tarball/eb40a89f6a/build/conda/envs/lsst-scipipe-12.1.0/include -mmacosx-version-min=14-arm -mmacosx-version-min=11.0 -Wl,-headerpad_max_install_names -Wl,-dead_strip_dylibs -Wl,-rpath,/Users/jenkins/j/workspace/release/tarball/eb40a89f6a/build/conda/envs/lsst-scipipe-12.1.0/lib -L/Users/jenkins/j/workspace/release/tarball/eb40a89f6a/build/conda/envs/lsst-scipipe-12.1.0/lib
Sanity check compile stdout:

-----
Sanity check compile stderr:

-----
Running test binary command:  /Users/jenkins/j/workspace/release/tarball/eb40a89f6a/build/conda/envs/lsst-scipipe-12.1.0/share/eups/EupsBuildDir/Darwin/gauss2d-gbf99507273+fd8379166f/gauss2d-gbf99507273+fd8379166f/build-release/meson-private/sanitycheckcpp.exe
-----------
Sanity check: `/Users/jenkins/j/workspace/release/tarball/eb40a89f6a/build/conda/envs/lsst-scipipe-12.1.0/share/eups/EupsBuildDir/Darwin/gauss2d-gbf99507273+fd8379166f/gauss2d-gbf99507273+fd8379166f/build-release/meson-private/sanitycheckcpp.exe` -> 0
C++ compiler for the build machine: arm64-apple-darwin20.0.0-clang++ (clang 19.1.7 "clang version 19.1.7")
C++ linker for the build machine: arm64-apple-darwin20.0.0-clang++ ld64 956.6
-----------
Detecting archiver via: `arm64-apple-darwin20.0.0-ar --version` -> 1
stderr:
usage:  ar -d [-TLsv] archive file ...
	ar -m [-TLsv] archive file ...
	ar -m [-abiTLsv] position archive file ...
	ar -p [-TLsv] archive [file ...]
	ar -q [-cTLsv] archive file ...
	ar -r [-cuTLsv] archive file ...
	ar -r [-abciuTLsv] position archive file ...
	ar -t [-TLsv] archive [file ...]
	ar -x [-ouTLsv] archive [file ...]
-----------
Build machine cpu family: aarch64
Build machine cpu: aarch64
Host machine cpu family: aarch64
Host machine cpu: aarch64
Target machine cpu family: aarch64
Target machine cpu: aarch64
Program eups found: YES (/Users/jenkins/j/workspace/release/tarball/eb40a89f6a/build/conda/envs/lsst-scipipe-12.1.0/eups/bin/eups)
Running command: /Users/jenkins/j/workspace/release/tarball/eb40a89f6a/build/conda/envs/lsst-scipipe-12.1.0/eups/bin/eups list gauss2d
--- stdout ---
   LOCAL:/Users/jenkins/j/workspace/release/tarball/eb40a89f6a/build/conda/envs/lsst-scipipe-12.1.0/share/eups/EupsBuildDir/Darwin/gauss2d-gbf99507273+fd8379166f/gauss2d-gbf99507273+fd8379166f 	setup
   gbf99507273+9de55b6e8b 	d_2026_02_20 d_2026_03_04 d_latest current d_2026_02_24 d_2026_03_02 d_2026_02_21 d_2026_02_23 d_2026_02_27 w_latest d_2026_03_03 d_2026_03_01 d_2026_02_25 w_2026_09 d_2026_02_28 w_2026_08

--- stderr ---


Adding test "centroid"
Adding test "coordinatesystem"
Adding test "ellipse"
Adding test "evaluate"
Adding test "gaussian"
Adding test "image"
Adding test "string_utils"
Adding test "to_string"
Adding test "type_name"
Build targets in project: 10

libgauss2d 0.3.0

  User defined options
    buildtype: release
    libdir   : lib
    prefix   : /Users/jenkins/j/workspace/release/tarball/eb40a89f6a/build/conda/envs/lsst-scipipe-12.1.0/share/eups/EupsBuildDir/Darwin/gauss2d-gbf99507273+fd8379166f/gauss2d-gbf99507273+fd8379166f/build-release

Found ninja-1.13.2 at /Users/jenkins/j/workspace/release/tarball/eb40a89f6a/build/conda/envs/lsst-scipipe-12.1.0/bin/ninja
Running compile:
Working directory:  /Users/jenkins/j/workspace/release/tarball/eb40a89f6a/build/conda/envs/lsst-scipipe-12.1.0/share/eups/EupsBuildDir/Darwin/gauss2d-gbf99507273+fd8379166f/gauss2d-gbf99507273+fd8379166f/build-release/meson-private/tmpoo319ht0
Code:

        #ifdef __has_include
         #if !__has_include("version")
          #error "Header 'version' could not be found"
         #endif
        #else
         #include <version>
        #endif
-----------
Command line: `arm64-apple-darwin20.0.0-clang++ /Users/jenkins/j/workspace/release/tarball/eb40a89f6a/build/conda/envs/lsst-scipipe-12.1.0/share/eups/EupsBuildDir/Darwin/gauss2d-gbf99507273+fd8379166f/gauss2d-gbf99507273+fd8379166f/build-release/meson-private/tmpoo319ht0/testfile.cpp -E -P -ftree-vectorize -fPIC -fstack-protector-strong -O2 -pipe -stdlib=libc++ -fvisibility-inlines-hidden -fmessage-length=0 -isystem /Users/jenkins/j/workspace/release/tarball/eb40a89f6a/build/conda/envs/lsst-scipipe-12.1.0/include -D_FORTIFY_SOURCE=2 -isystem /Users/jenkins/j/workspace/release/tarball/eb40a89f6a/build/conda/envs/lsst-scipipe-12.1.0/include -mmacosx-version-min=14-arm -mmacosx-version-min=11.0 -P -O0 -fpermissive -Werror=implicit-function-declaration` -> 0
Running compile:
Working directory:  /Users/jenkins/j/workspace/release/tarball/eb40a89f6a/build/conda/envs/lsst-scipipe-12.1.0/share/eups/EupsBuildDir/Darwin/gauss2d-gbf99507273+fd8379166f/gauss2d-gbf99507273+fd8379166f/build-release/meson-private/tmp8usru8gy
Code:

        #include <version>
        int main(void) {
            /* If it's not defined as a macro, try to use as a symbol */
            #ifndef _LIBCPP_VERSION
                _LIBCPP_VERSION;
            #endif
            return 0;
        }
-----------
Command line: `arm64-apple-darwin20.0.0-clang++ /Users/jenkins/j/workspace/release/tarball/eb40a89f6a/build/conda/envs/lsst-scipipe-12.1.0/share/eups/EupsBuildDir/Darwin/gauss2d-gbf99507273+fd8379166f/gauss2d-gbf99507273+fd8379166f/build-release/meson-private/tmp8usru8gy/testfile.cpp -o /Users/jenkins/j/workspace/release/tarball/eb40a89f6a/build/conda/envs/lsst-scipipe-12.1.0/share/eups/EupsBuildDir/Darwin/gauss2d-gbf99507273+fd8379166f/gauss2d-gbf99507273+fd8379166f/build-release/meson-private/tmp8usru8gy/output.obj -c -ftree-vectorize -fPIC -fstack-protector-strong -O2 -pipe -stdlib=libc++ -fvisibility-inlines-hidden -fmessage-length=0 -isystem /Users/jenkins/j/workspace/release/tarball/eb40a89f6a/build/conda/envs/lsst-scipipe-12.1.0/include -D_FORTIFY_SOURCE=2 -isystem /Users/jenkins/j/workspace/release/tarball/eb40a89f6a/build/conda/envs/lsst-scipipe-12.1.0/include -mmacosx-version-min=14-arm -mmacosx-version-min=11.0 -O0 -fpermissive -Werror=implicit-function-declaration -Werror=unknown-warning-option -Werror=unused-command-line-argument -Werror=ignored-optimization-argument` -> 0
Running compile:
Working directory:  /var/folders/9x/708ytvk10xdg3t5rj3q17jdr0000gp/T/tmpenq238if
Code:
int i = static_cast<int>(0);
-----------
Command line: `arm64-apple-darwin20.0.0-clang++ /var/folders/9x/708ytvk10xdg3t5rj3q17jdr0000gp/T/tmpenq238if/testfile.cpp -o /var/folders/9x/708ytvk10xdg3t5rj3q17jdr0000gp/T/tmpenq238if/output.obj -c -std=c++20` -> 0
Compiler accepts -std=c++20: YES
Using cached compile:
Cached command line:  arm64-apple-darwin20.0.0-clang++ /Users/jenkins/j/workspace/release/tarball/eb40a89f6a/build/conda/envs/lsst-scipipe-12.1.0/share/eups/EupsBuildDir/Darwin/gauss2d-gbf99507273+fd8379166f/gauss2d-gbf99507273+fd8379166f/build-release/meson-private/tmpoo319ht0/testfile.cpp -E -P -ftree-vectorize -fPIC -fstack-protector-strong -O2 -pipe -stdlib=libc++ -fvisibility-inlines-hidden -fmessage-length=0 -isystem /Users/jenkins/j/workspace/release/tarball/eb40a89f6a/build/conda/envs/lsst-scipipe-12.1.0/include -D_FORTIFY_SOURCE=2 -isystem /Users/jenkins/j/workspace/release/tarball/eb40a89f6a/build/conda/envs/lsst-scipipe-12.1.0/include -mmacosx-version-min=14-arm -mmacosx-version-min=11.0 -P -O0 -fpermissive -Werror=implicit-function-declaration 

Code:
 
        #ifdef __has_include
         #if !__has_include("version")
          #error "Header 'version' could not be found"
         #endif
        #else
         #include <version>
        #endif
Cached compiler stdout:
 

Cached compiler stderr:
 
Using cached compile:
Cached command line:  arm64-apple-darwin20.0.0-clang++ /Users/jenkins/j/workspace/release/tarball/eb40a89f6a/build/conda/envs/lsst-scipipe-12.1.0/share/eups/EupsBuildDir/Darwin/gauss2d-gbf99507273+fd8379166f/gauss2d-gbf99507273+fd8379166f/build-release/meson-private/tmp8usru8gy/testfile.cpp -o /Users/jenkins/j/workspace/release/tarball/eb40a89f6a/build/conda/envs/lsst-scipipe-12.1.0/share/eups/EupsBuildDir/Darwin/gauss2d-gbf99507273+fd8379166f/gauss2d-gbf99507273+fd8379166f/build-release/meson-private/tmp8usru8gy/output.obj -c -ftree-vectorize -fPIC -fstack-protector-strong -O2 -pipe -stdlib=libc++ -fvisibility-inlines-hidden -fmessage-length=0 -isystem /Users/jenkins/j/workspace/release/tarball/eb40a89f6a/build/conda/envs/lsst-scipipe-12.1.0/include -D_FORTIFY_SOURCE=2 -isystem /Users/jenkins/j/workspace/release/tarball/eb40a89f6a/build/conda/envs/lsst-scipipe-12.1.0/include -mmacosx-version-min=14-arm -mmacosx-version-min=11.0 -O0 -fpermissive -Werror=implicit-function-declaration -Werror=unknown-warning-option -Werror=unused-command-line-argument -Werror=ignored-optimization-argument 

Code:
 
        #include <version>
        int main(void) {
            /* If it's not defined as a macro, try to use as a symbol */
            #ifndef _LIBCPP_VERSION
                _LIBCPP_VERSION;
            #endif
            return 0;
        }
Cached compiler stdout:
 
Cached compiler stderr:
 
Using cached compile:
Cached command line:  arm64-apple-darwin20.0.0-clang++ /Users/jenkins/j/workspace/release/tarball/eb40a89f6a/build/conda/envs/lsst-scipipe-12.1.0/share/eups/EupsBuildDir/Darwin/gauss2d-gbf99507273+fd8379166f/gauss2d-gbf99507273+fd8379166f/build-release/meson-private/tmpoo319ht0/testfile.cpp -E -P -ftree-vectorize -fPIC -fstack-protector-strong -O2 -pipe -stdlib=libc++ -fvisibility-inlines-hidden -fmessage-length=0 -isystem /Users/jenkins/j/workspace/release/tarball/eb40a89f6a/build/conda/envs/lsst-scipipe-12.1.0/include -D_FORTIFY_SOURCE=2 -isystem /Users/jenkins/j/workspace/release/tarball/eb40a89f6a/build/conda/envs/lsst-scipipe-12.1.0/include -mmacosx-version-min=14-arm -mmacosx-version-min=11.0 -P -O0 -fpermissive -Werror=implicit-function-declaration 

Code:
 
        #ifdef __has_include
         #if !__has_include("version")
          #error "Header 'version' could not be found"
         #endif
        #else
         #include <version>
        #endif
Cached compiler stdout:
 

Cached compiler stderr:
 
Using cached compile:
Cached command line:  arm64-apple-darwin20.0.0-clang++ /Users/jenkins/j/workspace/release/tarball/eb40a89f6a/build/conda/envs/lsst-scipipe-12.1.0/share/eups/EupsBuildDir/Darwin/gauss2d-gbf99507273+fd8379166f/gauss2d-gbf99507273+fd8379166f/build-release/meson-private/tmp8usru8gy/testfile.cpp -o /Users/jenkins/j/workspace/release/tarball/eb40a89f6a/build/conda/envs/lsst-scipipe-12.1.0/share/eups/EupsBuildDir/Darwin/gauss2d-gbf99507273+fd8379166f/gauss2d-gbf99507273+fd8379166f/build-release/meson-private/tmp8usru8gy/output.obj -c -ftree-vectorize -fPIC -fstack-protector-strong -O2 -pipe -stdlib=libc++ -fvisibility-inlines-hidden -fmessage-length=0 -isystem /Users/jenkins/j/workspace/release/tarball/eb40a89f6a/build/conda/envs/lsst-scipipe-12.1.0/include -D_FORTIFY_SOURCE=2 -isystem /Users/jenkins/j/workspace/release/tarball/eb40a89f6a/build/conda/envs/lsst-scipipe-12.1.0/include -mmacosx-version-min=14-arm -mmacosx-version-min=11.0 -O0 -fpermissive -Werror=implicit-function-declaration -Werror=unknown-warning-option -Werror=unused-command-line-argument -Werror=ignored-optimization-argument 

Code:
 
        #include <version>
        int main(void) {
            /* If it's not defined as a macro, try to use as a symbol */
            #ifndef _LIBCPP_VERSION
                _LIBCPP_VERSION;
            #endif
            return 0;
        }
Cached compiler stdout:
 
Cached compiler stderr:
 
Using cached compile:
Cached command line:  arm64-apple-darwin20.0.0-clang++ /Users/jenkins/j/workspace/release/tarball/eb40a89f6a/build/conda/envs/lsst-scipipe-12.1.0/share/eups/EupsBuildDir/Darwin/gauss2d-gbf99507273+fd8379166f/gauss2d-gbf99507273+fd8379166f/build-release/meson-private/tmpoo319ht0/testfile.cpp -E -P -ftree-vectorize -fPIC -fstack-protector-strong -O2 -pipe -stdlib=libc++ -fvisibility-inlines-hidden -fmessage-length=0 -isystem /Users/jenkins/j/workspace/release/tarball/eb40a89f6a/build/conda/envs/lsst-scipipe-12.1.0/include -D_FORTIFY_SOURCE=2 -isystem /Users/jenkins/j/workspace/release/tarball/eb40a89f6a/build/conda/envs/lsst-scipipe-12.1.0/include -mmacosx-version-min=14-arm -mmacosx-version-min=11.0 -P -O0 -fpermissive -Werror=implicit-function-declaration 

Code:
 
        #ifdef __has_include
         #if !__has_include("version")
          #error "Header 'version' could not be found"
         #endif
        #else
         #include <version>
        #endif
Cached compiler stdout:
 

Cached compiler stderr:
 
Using cached compile:
Cached command line:  arm64-apple-darwin20.0.0-clang++ /Users/jenkins/j/workspace/release/tarball/eb40a89f6a/build/conda/envs/lsst-scipipe-12.1.0/share/eups/EupsBuildDir/Darwin/gauss2d-gbf99507273+fd8379166f/gauss2d-gbf99507273+fd8379166f/build-release/meson-private/tmp8usru8gy/testfile.cpp -o /Users/jenkins/j/workspace/release/tarball/eb40a89f6a/build/conda/envs/lsst-scipipe-12.1.0/share/eups/EupsBuildDir/Darwin/gauss2d-gbf99507273+fd8379166f/gauss2d-gbf99507273+fd8379166f/build-release/meson-private/tmp8usru8gy/output.obj -c -ftree-vectorize -fPIC -fstack-protector-strong -O2 -pipe -stdlib=libc++ -fvisibility-inlines-hidden -fmessage-length=0 -isystem /Users/jenkins/j/workspace/release/tarball/eb40a89f6a/build/conda/envs/lsst-scipipe-12.1.0/include -D_FORTIFY_SOURCE=2 -isystem /Users/jenkins/j/workspace/release/tarball/eb40a89f6a/build/conda/envs/lsst-scipipe-12.1.0/include -mmacosx-version-min=14-arm -mmacosx-version-min=11.0 -O0 -fpermissive -Werror=implicit-function-declaration -Werror=unknown-warning-option -Werror=unused-command-line-argument -Werror=ignored-optimization-argument 

Code:
 
        #include <version>
        int main(void) {
            /* If it's not defined as a macro, try to use as a symbol */
            #ifndef _LIBCPP_VERSION
                _LIBCPP_VERSION;
            #endif
            return 0;
        }
Cached compiler stdout:
 
Cached compiler stderr:
 
Using cached compile:
Cached command line:  arm64-apple-darwin20.0.0-clang++ /Users/jenkins/j/workspace/release/tarball/eb40a89f6a/build/conda/envs/lsst-scipipe-12.1.0/share/eups/EupsBuildDir/Darwin/gauss2d-gbf99507273+fd8379166f/gauss2d-gbf99507273+fd8379166f/build-release/meson-private/tmpoo319ht0/testfile.cpp -E -P -ftree-vectorize -fPIC -fstack-protector-strong -O2 -pipe -stdlib=libc++ -fvisibility-inlines-hidden -fmessage-length=0 -isystem /Users/jenkins/j/workspace/release/tarball/eb40a89f6a/build/conda/envs/lsst-scipipe-12.1.0/include -D_FORTIFY_SOURCE=2 -isystem /Users/jenkins/j/workspace/release/tarball/eb40a89f6a/build/conda/envs/lsst-scipipe-12.1.0/include -mmacosx-version-min=14-arm -mmacosx-version-min=11.0 -P -O0 -fpermissive -Werror=implicit-function-declaration 

Code:
 
        #ifdef __has_include
         #if !__has_include("version")
          #error "Header 'version' could not be found"
         #endif
        #else
         #include <version>
        #endif
Cached compiler stdout:
 

Cached compiler stderr:
 
Using cached compile:
Cached command line:  arm64-apple-darwin20.0.0-clang++ /Users/jenkins/j/workspace/release/tarball/eb40a89f6a/build/conda/envs/lsst-scipipe-12.1.0/share/eups/EupsBuildDir/Darwin/gauss2d-gbf99507273+fd8379166f/gauss2d-gbf99507273+fd8379166f/build-release/meson-private/tmp8usru8gy/testfile.cpp -o /Users/jenkins/j/workspace/release/tarball/eb40a89f6a/build/conda/envs/lsst-scipipe-12.1.0/share/eups/EupsBuildDir/Darwin/gauss2d-gbf99507273+fd8379166f/gauss2d-gbf99507273+fd8379166f/build-release/meson-private/tmp8usru8gy/output.obj -c -ftree-vectorize -fPIC -fstack-protector-strong -O2 -pipe -stdlib=libc++ -fvisibility-inlines-hidden -fmessage-length=0 -isystem /Users/jenkins/j/workspace/release/tarball/eb40a89f6a/build/conda/envs/lsst-scipipe-12.1.0/include -D_FORTIFY_SOURCE=2 -isystem /Users/jenkins/j/workspace/release/tarball/eb40a89f6a/build/conda/envs/lsst-scipipe-12.1.0/include -mmacosx-version-min=14-arm -mmacosx-version-min=11.0 -O0 -fpermissive -Werror=implicit-function-declaration -Werror=unknown-warning-option -Werror=unused-command-line-argument -Werror=ignored-optimization-argument 

Code:
 
        #include <version>
        int main(void) {
            /* If it's not defined as a macro, try to use as a symbol */
            #ifndef _LIBCPP_VERSION
                _LIBCPP_VERSION;
            #endif
            return 0;
        }
Cached compiler stdout:
 
Cached compiler stderr:
 
Running compile:
Working directory:  /Users/jenkins/j/workspace/release/tarball/eb40a89f6a/build/conda/envs/lsst-scipipe-12.1.0/share/eups/EupsBuildDir/Darwin/gauss2d-gbf99507273+fd8379166f/gauss2d-gbf99507273+fd8379166f/build-release/meson-private/tmpoq6o70vu
Code:

-----------
Command line: `arm64-apple-darwin20.0.0-clang++ /Users/jenkins/j/workspace/release/tarball/eb40a89f6a/build/conda/envs/lsst-scipipe-12.1.0/share/eups/EupsBuildDir/Darwin/gauss2d-gbf99507273+fd8379166f/gauss2d-gbf99507273+fd8379166f/build-release/meson-private/tmpoq6o70vu/testfile.cpp -o /Users/jenkins/j/workspace/release/tarball/eb40a89f6a/build/conda/envs/lsst-scipipe-12.1.0/share/eups/EupsBuildDir/Darwin/gauss2d-gbf99507273+fd8379166f/gauss2d-gbf99507273+fd8379166f/build-release/meson-private/tmpoq6o70vu/output.obj -c -ftree-vectorize -fPIC -fstack-protector-strong -O2 -pipe -stdlib=libc++ -fvisibility-inlines-hidden -fmessage-length=0 -isystem /Users/jenkins/j/workspace/release/tarball/eb40a89f6a/build/conda/envs/lsst-scipipe-12.1.0/include -D_FORTIFY_SOURCE=2 -isystem /Users/jenkins/j/workspace/release/tarball/eb40a89f6a/build/conda/envs/lsst-scipipe-12.1.0/include -mmacosx-version-min=14-arm -mmacosx-version-min=11.0 -O0 -fpermissive -Werror=implicit-function-declaration -Werror=unknown-warning-option -Werror=unused-command-line-argument -Werror=ignored-optimization-argument --print-search-dirs` -> 0
stdout:
programs: =/Users/jenkins/j/workspace/release/tarball/eb40a89f6a/build/conda/envs/lsst-scipipe-12.1.0/bin
libraries: =/Users/jenkins/j/workspace/release/tarball/eb40a89f6a/build/conda/envs/lsst-scipipe-12.1.0/lib/clang/19
-----------
Using cached compile:
Cached command line:  arm64-apple-darwin20.0.0-clang++ /Users/jenkins/j/workspace/release/tarball/eb40a89f6a/build/conda/envs/lsst-scipipe-12.1.0/share/eups/EupsBuildDir/Darwin/gauss2d-gbf99507273+fd8379166f/gauss2d-gbf99507273+fd8379166f/build-release/meson-private/tmpoo319ht0/testfile.cpp -E -P -ftree-vectorize -fPIC -fstack-protector-strong -O2 -pipe -stdlib=libc++ -fvisibility-inlines-hidden -fmessage-length=0 -isystem /Users/jenkins/j/workspace/release/tarball/eb40a89f6a/build/conda/envs/lsst-scipipe-12.1.0/include -D_FORTIFY_SOURCE=2 -isystem /Users/jenkins/j/workspace/release/tarball/eb40a89f6a/build/conda/envs/lsst-scipipe-12.1.0/include -mmacosx-version-min=14-arm -mmacosx-version-min=11.0 -P -O0 -fpermissive -Werror=implicit-function-declaration 

Code:
 
        #ifdef __has_include
         #if !__has_include("version")
          #error "Header 'version' could not be found"
         #endif
        #else
         #include <version>
        #endif
Cached compiler stdout:
 

Cached compiler stderr:
 
Using cached compile:
Cached command line:  arm64-apple-darwin20.0.0-clang++ /Users/jenkins/j/workspace/release/tarball/eb40a89f6a/build/conda/envs/lsst-scipipe-12.1.0/share/eups/EupsBuildDir/Darwin/gauss2d-gbf99507273+fd8379166f/gauss2d-gbf99507273+fd8379166f/build-release/meson-private/tmp8usru8gy/testfile.cpp -o /Users/jenkins/j/workspace/release/tarball/eb40a89f6a/build/conda/envs/lsst-scipipe-12.1.0/share/eups/EupsBuildDir/Darwin/gauss2d-gbf99507273+fd8379166f/gauss2d-gbf99507273+fd8379166f/build-release/meson-private/tmp8usru8gy/output.obj -c -ftree-vectorize -fPIC -fstack-protector-strong -O2 -pipe -stdlib=libc++ -fvisibility-inlines-hidden -fmessage-length=0 -isystem /Users/jenkins/j/workspace/release/tarball/eb40a89f6a/build/conda/envs/lsst-scipipe-12.1.0/include -D_FORTIFY_SOURCE=2 -isystem /Users/jenkins/j/workspace/release/tarball/eb40a89f6a/build/conda/envs/lsst-scipipe-12.1.0/include -mmacosx-version-min=14-arm -mmacosx-version-min=11.0 -O0 -fpermissive -Werror=implicit-function-declaration -Werror=unknown-warning-option -Werror=unused-command-line-argument -Werror=ignored-optimization-argument 

Code:
 
        #include <version>
        int main(void) {
            /* If it's not defined as a macro, try to use as a symbol */
            #ifndef _LIBCPP_VERSION
                _LIBCPP_VERSION;
            #endif
            return 0;
        }
Cached compiler stdout:
 
Cached compiler stderr:
 
Using cached compile:
Cached command line:  arm64-apple-darwin20.0.0-clang++ /Users/jenkins/j/workspace/release/tarball/eb40a89f6a/build/conda/envs/lsst-scipipe-12.1.0/share/eups/EupsBuildDir/Darwin/gauss2d-gbf99507273+fd8379166f/gauss2d-gbf99507273+fd8379166f/build-release/meson-private/tmpoo319ht0/testfile.cpp -E -P -ftree-vectorize -fPIC -fstack-protector-strong -O2 -pipe -stdlib=libc++ -fvisibility-inlines-hidden -fmessage-length=0 -isystem /Users/jenkins/j/workspace/release/tarball/eb40a89f6a/build/conda/envs/lsst-scipipe-12.1.0/include -D_FORTIFY_SOURCE=2 -isystem /Users/jenkins/j/workspace/release/tarball/eb40a89f6a/build/conda/envs/lsst-scipipe-12.1.0/include -mmacosx-version-min=14-arm -mmacosx-version-min=11.0 -P -O0 -fpermissive -Werror=implicit-function-declaration 

Code:
 
        #ifdef __has_include
         #if !__has_include("version")
          #error "Header 'version' could not be found"
         #endif
        #else
         #include <version>
        #endif
Cached compiler stdout:
 

Cached compiler stderr:
 
Using cached compile:
Cached command line:  arm64-apple-darwin20.0.0-clang++ /Users/jenkins/j/workspace/release/tarball/eb40a89f6a/build/conda/envs/lsst-scipipe-12.1.0/share/eups/EupsBuildDir/Darwin/gauss2d-gbf99507273+fd8379166f/gauss2d-gbf99507273+fd8379166f/build-release/meson-private/tmp8usru8gy/testfile.cpp -o /Users/jenkins/j/workspace/release/tarball/eb40a89f6a/build/conda/envs/lsst-scipipe-12.1.0/share/eups/EupsBuildDir/Darwin/gauss2d-gbf99507273+fd8379166f/gauss2d-gbf99507273+fd8379166f/build-release/meson-private/tmp8usru8gy/output.obj -c -ftree-vectorize -fPIC -fstack-protector-strong -O2 -pipe -stdlib=libc++ -fvisibility-inlines-hidden -fmessage-length=0 -isystem /Users/jenkins/j/workspace/release/tarball/eb40a89f6a/build/conda/envs/lsst-scipipe-12.1.0/include -D_FORTIFY_SOURCE=2 -isystem /Users/jenkins/j/workspace/release/tarball/eb40a89f6a/build/conda/envs/lsst-scipipe-12.1.0/include -mmacosx-version-min=14-arm -mmacosx-version-min=11.0 -O0 -fpermissive -Werror=implicit-function-declaration -Werror=unknown-warning-option -Werror=unused-command-line-argument -Werror=ignored-optimization-argument 

Code:
 
        #include <version>
        int main(void) {
            /* If it's not defined as a macro, try to use as a symbol */
            #ifndef _LIBCPP_VERSION
                _LIBCPP_VERSION;
            #endif
            return 0;
        }
Cached compiler stdout:
 
Cached compiler stderr:
 
Using cached compile:
Cached command line:  arm64-apple-darwin20.0.0-clang++ /Users/jenkins/j/workspace/release/tarball/eb40a89f6a/build/conda/envs/lsst-scipipe-12.1.0/share/eups/EupsBuildDir/Darwin/gauss2d-gbf99507273+fd8379166f/gauss2d-gbf99507273+fd8379166f/build-release/meson-private/tmpoo319ht0/testfile.cpp -E -P -ftree-vectorize -fPIC -fstack-protector-strong -O2 -pipe -stdlib=libc++ -fvisibility-inlines-hidden -fmessage-length=0 -isystem /Users/jenkins/j/workspace/release/tarball/eb40a89f6a/build/conda/envs/lsst-scipipe-12.1.0/include -D_FORTIFY_SOURCE=2 -isystem /Users/jenkins/j/workspace/release/tarball/eb40a89f6a/build/conda/envs/lsst-scipipe-12.1.0/include -mmacosx-version-min=14-arm -mmacosx-version-min=11.0 -P -O0 -fpermissive -Werror=implicit-function-declaration 

Code:
 
        #ifdef __has_include
         #if !__has_include("version")
          #error "Header 'version' could not be found"
         #endif
        #else
         #include <version>
        #endif
Cached compiler stdout:
 

Cached compiler stderr:
 
Using cached compile:
Cached command line:  arm64-apple-darwin20.0.0-clang++ /Users/jenkins/j/workspace/release/tarball/eb40a89f6a/build/conda/envs/lsst-scipipe-12.1.0/share/eups/EupsBuildDir/Darwin/gauss2d-gbf99507273+fd8379166f/gauss2d-gbf99507273+fd8379166f/build-release/meson-private/tmp8usru8gy/testfile.cpp -o /Users/jenkins/j/workspace/release/tarball/eb40a89f6a/build/conda/envs/lsst-scipipe-12.1.0/share/eups/EupsBuildDir/Darwin/gauss2d-gbf99507273+fd8379166f/gauss2d-gbf99507273+fd8379166f/build-release/meson-private/tmp8usru8gy/output.obj -c -ftree-vectorize -fPIC -fstack-protector-strong -O2 -pipe -stdlib=libc++ -fvisibility-inlines-hidden -fmessage-length=0 -isystem /Users/jenkins/j/workspace/release/tarball/eb40a89f6a/build/conda/envs/lsst-scipipe-12.1.0/include -D_FORTIFY_SOURCE=2 -isystem /Users/jenkins/j/workspace/release/tarball/eb40a89f6a/build/conda/envs/lsst-scipipe-12.1.0/include -mmacosx-version-min=14-arm -mmacosx-version-min=11.0 -O0 -fpermissive -Werror=implicit-function-declaration -Werror=unknown-warning-option -Werror=unused-command-line-argument -Werror=ignored-optimization-argument 

Code:
 
        #include <version>
        int main(void) {
            /* If it's not defined as a macro, try to use as a symbol */
            #ifndef _LIBCPP_VERSION
                _LIBCPP_VERSION;
            #endif
            return 0;
        }
Cached compiler stdout:
 
Cached compiler stderr:
 
Using cached compile:
Cached command line:  arm64-apple-darwin20.0.0-clang++ /Users/jenkins/j/workspace/release/tarball/eb40a89f6a/build/conda/envs/lsst-scipipe-12.1.0/share/eups/EupsBuildDir/Darwin/gauss2d-gbf99507273+fd8379166f/gauss2d-gbf99507273+fd8379166f/build-release/meson-private/tmpoo319ht0/testfile.cpp -E -P -ftree-vectorize -fPIC -fstack-protector-strong -O2 -pipe -stdlib=libc++ -fvisibility-inlines-hidden -fmessage-length=0 -isystem /Users/jenkins/j/workspace/release/tarball/eb40a89f6a/build/conda/envs/lsst-scipipe-12.1.0/include -D_FORTIFY_SOURCE=2 -isystem /Users/jenkins/j/workspace/release/tarball/eb40a89f6a/build/conda/envs/lsst-scipipe-12.1.0/include -mmacosx-version-min=14-arm -mmacosx-version-min=11.0 -P -O0 -fpermissive -Werror=implicit-function-declaration 

Code:
 
        #ifdef __has_include
         #if !__has_include("version")
          #error "Header 'version' could not be found"
         #endif
        #else
         #include <version>
        #endif
Cached compiler stdout:
 

Cached compiler stderr:
 
Using cached compile:
Cached command line:  arm64-apple-darwin20.0.0-clang++ /Users/jenkins/j/workspace/release/tarball/eb40a89f6a/build/conda/envs/lsst-scipipe-12.1.0/share/eups/EupsBuildDir/Darwin/gauss2d-gbf99507273+fd8379166f/gauss2d-gbf99507273+fd8379166f/build-release/meson-private/tmp8usru8gy/testfile.cpp -o /Users/jenkins/j/workspace/release/tarball/eb40a89f6a/build/conda/envs/lsst-scipipe-12.1.0/share/eups/EupsBuildDir/Darwin/gauss2d-gbf99507273+fd8379166f/gauss2d-gbf99507273+fd8379166f/build-release/meson-private/tmp8usru8gy/output.obj -c -ftree-vectorize -fPIC -fstack-protector-strong -O2 -pipe -stdlib=libc++ -fvisibility-inlines-hidden -fmessage-length=0 -isystem /Users/jenkins/j/workspace/release/tarball/eb40a89f6a/build/conda/envs/lsst-scipipe-12.1.0/include -D_FORTIFY_SOURCE=2 -isystem /Users/jenkins/j/workspace/release/tarball/eb40a89f6a/build/conda/envs/lsst-scipipe-12.1.0/include -mmacosx-version-min=14-arm -mmacosx-version-min=11.0 -O0 -fpermissive -Werror=implicit-function-declaration -Werror=unknown-warning-option -Werror=unused-command-line-argument -Werror=ignored-optimization-argument 

Code:
 
        #include <version>
        int main(void) {
            /* If it's not defined as a macro, try to use as a symbol */
            #ifndef _LIBCPP_VERSION
                _LIBCPP_VERSION;
            #endif
            return 0;
        }
Cached compiler stdout:
 
Cached compiler stderr:
 
Using cached compile:
Cached command line:  arm64-apple-darwin20.0.0-clang++ /Users/jenkins/j/workspace/release/tarball/eb40a89f6a/build/conda/envs/lsst-scipipe-12.1.0/share/eups/EupsBuildDir/Darwin/gauss2d-gbf99507273+fd8379166f/gauss2d-gbf99507273+fd8379166f/build-release/meson-private/tmpoo319ht0/testfile.cpp -E -P -ftree-vectorize -fPIC -fstack-protector-strong -O2 -pipe -stdlib=libc++ -fvisibility-inlines-hidden -fmessage-length=0 -isystem /Users/jenkins/j/workspace/release/tarball/eb40a89f6a/build/conda/envs/lsst-scipipe-12.1.0/include -D_FORTIFY_SOURCE=2 -isystem /Users/jenkins/j/workspace/release/tarball/eb40a89f6a/build/conda/envs/lsst-scipipe-12.1.0/include -mmacosx-version-min=14-arm -mmacosx-version-min=11.0 -P -O0 -fpermissive -Werror=implicit-function-declaration 

Code:
 
        #ifdef __has_include
         #if !__has_include("version")
          #error "Header 'version' could not be found"
         #endif
        #else
         #include <version>
        #endif
Cached compiler stdout:
 

Cached compiler stderr:
 
Using cached compile:
Cached command line:  arm64-apple-darwin20.0.0-clang++ /Users/jenkins/j/workspace/release/tarball/eb40a89f6a/build/conda/envs/lsst-scipipe-12.1.0/share/eups/EupsBuildDir/Darwin/gauss2d-gbf99507273+fd8379166f/gauss2d-gbf99507273+fd8379166f/build-release/meson-private/tmp8usru8gy/testfile.cpp -o /Users/jenkins/j/workspace/release/tarball/eb40a89f6a/build/conda/envs/lsst-scipipe-12.1.0/share/eups/EupsBuildDir/Darwin/gauss2d-gbf99507273+fd8379166f/gauss2d-gbf99507273+fd8379166f/build-release/meson-private/tmp8usru8gy/output.obj -c -ftree-vectorize -fPIC -fstack-protector-strong -O2 -pipe -stdlib=libc++ -fvisibility-inlines-hidden -fmessage-length=0 -isystem /Users/jenkins/j/workspace/release/tarball/eb40a89f6a/build/conda/envs/lsst-scipipe-12.1.0/include -D_FORTIFY_SOURCE=2 -isystem /Users/jenkins/j/workspace/release/tarball/eb40a89f6a/build/conda/envs/lsst-scipipe-12.1.0/include -mmacosx-version-min=14-arm -mmacosx-version-min=11.0 -O0 -fpermissive -Werror=implicit-function-declaration -Werror=unknown-warning-option -Werror=unused-command-line-argument -Werror=ignored-optimization-argument 

Code:
 
        #include <version>
        int main(void) {
            /* If it's not defined as a macro, try to use as a symbol */
            #ifndef _LIBCPP_VERSION
                _LIBCPP_VERSION;
            #endif
            return 0;
        }
Cached compiler stdout:
 
Cached compiler stderr:
 
Using cached compile:
Cached command line:  arm64-apple-darwin20.0.0-clang++ /Users/jenkins/j/workspace/release/tarball/eb40a89f6a/build/conda/envs/lsst-scipipe-12.1.0/share/eups/EupsBuildDir/Darwin/gauss2d-gbf99507273+fd8379166f/gauss2d-gbf99507273+fd8379166f/build-release/meson-private/tmpoo319ht0/testfile.cpp -E -P -ftree-vectorize -fPIC -fstack-protector-strong -O2 -pipe -stdlib=libc++ -fvisibility-inlines-hidden -fmessage-length=0 -isystem /Users/jenkins/j/workspace/release/tarball/eb40a89f6a/build/conda/envs/lsst-scipipe-12.1.0/include -D_FORTIFY_SOURCE=2 -isystem /Users/jenkins/j/workspace/release/tarball/eb40a89f6a/build/conda/envs/lsst-scipipe-12.1.0/include -mmacosx-version-min=14-arm -mmacosx-version-min=11.0 -P -O0 -fpermissive -Werror=implicit-function-declaration 

Code:
 
        #ifdef __has_include
         #if !__has_include("version")
          #error "Header 'version' could not be found"
         #endif
        #else
         #include <version>
        #endif
Cached compiler stdout:
 

Cached compiler stderr:
 
Using cached compile:
Cached command line:  arm64-apple-darwin20.0.0-clang++ /Users/jenkins/j/workspace/release/tarball/eb40a89f6a/build/conda/envs/lsst-scipipe-12.1.0/share/eups/EupsBuildDir/Darwin/gauss2d-gbf99507273+fd8379166f/gauss2d-gbf99507273+fd8379166f/build-release/meson-private/tmp8usru8gy/testfile.cpp -o /Users/jenkins/j/workspace/release/tarball/eb40a89f6a/build/conda/envs/lsst-scipipe-12.1.0/share/eups/EupsBuildDir/Darwin/gauss2d-gbf99507273+fd8379166f/gauss2d-gbf99507273+fd8379166f/build-release/meson-private/tmp8usru8gy/output.obj -c -ftree-vectorize -fPIC -fstack-protector-strong -O2 -pipe -stdlib=libc++ -fvisibility-inlines-hidden -fmessage-length=0 -isystem /Users/jenkins/j/workspace/release/tarball/eb40a89f6a/build/conda/envs/lsst-scipipe-12.1.0/include -D_FORTIFY_SOURCE=2 -isystem /Users/jenkins/j/workspace/release/tarball/eb40a89f6a/build/conda/envs/lsst-scipipe-12.1.0/include -mmacosx-version-min=14-arm -mmacosx-version-min=11.0 -O0 -fpermissive -Werror=implicit-function-declaration -Werror=unknown-warning-option -Werror=unused-command-line-argument -Werror=ignored-optimization-argument 

Code:
 
        #include <version>
        int main(void) {
            /* If it's not defined as a macro, try to use as a symbol */
            #ifndef _LIBCPP_VERSION
                _LIBCPP_VERSION;
            #endif
            return 0;
        }
Cached compiler stdout:
 
Cached compiler stderr:
 
Using cached compile:
Cached command line:  arm64-apple-darwin20.0.0-clang++ /Users/jenkins/j/workspace/release/tarball/eb40a89f6a/build/conda/envs/lsst-scipipe-12.1.0/share/eups/EupsBuildDir/Darwin/gauss2d-gbf99507273+fd8379166f/gauss2d-gbf99507273+fd8379166f/build-release/meson-private/tmpoo319ht0/testfile.cpp -E -P -ftree-vectorize -fPIC -fstack-protector-strong -O2 -pipe -stdlib=libc++ -fvisibility-inlines-hidden -fmessage-length=0 -isystem /Users/jenkins/j/workspace/release/tarball/eb40a89f6a/build/conda/envs/lsst-scipipe-12.1.0/include -D_FORTIFY_SOURCE=2 -isystem /Users/jenkins/j/workspace/release/tarball/eb40a89f6a/build/conda/envs/lsst-scipipe-12.1.0/include -mmacosx-version-min=14-arm -mmacosx-version-min=11.0 -P -O0 -fpermissive -Werror=implicit-function-declaration 

Code:
 
        #ifdef __has_include
         #if !__has_include("version")
          #error "Header 'version' could not be found"
         #endif
        #else
         #include <version>
        #endif
Cached compiler stdout:
 

Cached compiler stderr:
 
Using cached compile:
Cached command line:  arm64-apple-darwin20.0.0-clang++ /Users/jenkins/j/workspace/release/tarball/eb40a89f6a/build/conda/envs/lsst-scipipe-12.1.0/share/eups/EupsBuildDir/Darwin/gauss2d-gbf99507273+fd8379166f/gauss2d-gbf99507273+fd8379166f/build-release/meson-private/tmp8usru8gy/testfile.cpp -o /Users/jenkins/j/workspace/release/tarball/eb40a89f6a/build/conda/envs/lsst-scipipe-12.1.0/share/eups/EupsBuildDir/Darwin/gauss2d-gbf99507273+fd8379166f/gauss2d-gbf99507273+fd8379166f/build-release/meson-private/tmp8usru8gy/output.obj -c -ftree-vectorize -fPIC -fstack-protector-strong -O2 -pipe -stdlib=libc++ -fvisibility-inlines-hidden -fmessage-length=0 -isystem /Users/jenkins/j/workspace/release/tarball/eb40a89f6a/build/conda/envs/lsst-scipipe-12.1.0/include -D_FORTIFY_SOURCE=2 -isystem /Users/jenkins/j/workspace/release/tarball/eb40a89f6a/build/conda/envs/lsst-scipipe-12.1.0/include -mmacosx-version-min=14-arm -mmacosx-version-min=11.0 -O0 -fpermissive -Werror=implicit-function-declaration -Werror=unknown-warning-option -Werror=unused-command-line-argument -Werror=ignored-optimization-argument 

Code:
 
        #include <version>
        int main(void) {
            /* If it's not defined as a macro, try to use as a symbol */
            #ifndef _LIBCPP_VERSION
                _LIBCPP_VERSION;
            #endif
            return 0;
        }
Cached compiler stdout:
 
Cached compiler stderr:
 
Using cached compile:
Cached command line:  arm64-apple-darwin20.0.0-clang++ /Users/jenkins/j/workspace/release/tarball/eb40a89f6a/build/conda/envs/lsst-scipipe-12.1.0/share/eups/EupsBuildDir/Darwin/gauss2d-gbf99507273+fd8379166f/gauss2d-gbf99507273+fd8379166f/build-release/meson-private/tmpoo319ht0/testfile.cpp -E -P -ftree-vectorize -fPIC -fstack-protector-strong -O2 -pipe -stdlib=libc++ -fvisibility-inlines-hidden -fmessage-length=0 -isystem /Users/jenkins/j/workspace/release/tarball/eb40a89f6a/build/conda/envs/lsst-scipipe-12.1.0/include -D_FORTIFY_SOURCE=2 -isystem /Users/jenkins/j/workspace/release/tarball/eb40a89f6a/build/conda/envs/lsst-scipipe-12.1.0/include -mmacosx-version-min=14-arm -mmacosx-version-min=11.0 -P -O0 -fpermissive -Werror=implicit-function-declaration 

Code:
 
        #ifdef __has_include
         #if !__has_include("version")
          #error "Header 'version' could not be found"
         #endif
        #else
         #include <version>
        #endif
Cached compiler stdout:
 

Cached compiler stderr:
 
Using cached compile:
Cached command line:  arm64-apple-darwin20.0.0-clang++ /Users/jenkins/j/workspace/release/tarball/eb40a89f6a/build/conda/envs/lsst-scipipe-12.1.0/share/eups/EupsBuildDir/Darwin/gauss2d-gbf99507273+fd8379166f/gauss2d-gbf99507273+fd8379166f/build-release/meson-private/tmp8usru8gy/testfile.cpp -o /Users/jenkins/j/workspace/release/tarball/eb40a89f6a/build/conda/envs/lsst-scipipe-12.1.0/share/eups/EupsBuildDir/Darwin/gauss2d-gbf99507273+fd8379166f/gauss2d-gbf99507273+fd8379166f/build-release/meson-private/tmp8usru8gy/output.obj -c -ftree-vectorize -fPIC -fstack-protector-strong -O2 -pipe -stdlib=libc++ -fvisibility-inlines-hidden -fmessage-length=0 -isystem /Users/jenkins/j/workspace/release/tarball/eb40a89f6a/build/conda/envs/lsst-scipipe-12.1.0/include -D_FORTIFY_SOURCE=2 -isystem /Users/jenkins/j/workspace/release/tarball/eb40a89f6a/build/conda/envs/lsst-scipipe-12.1.0/include -mmacosx-version-min=14-arm -mmacosx-version-min=11.0 -O0 -fpermissive -Werror=implicit-function-declaration -Werror=unknown-warning-option -Werror=unused-command-line-argument -Werror=ignored-optimization-argument 

Code:
 
        #include <version>
        int main(void) {
            /* If it's not defined as a macro, try to use as a symbol */
            #ifndef _LIBCPP_VERSION
                _LIBCPP_VERSION;
            #endif
            return 0;
        }
Cached compiler stdout:
 
Cached compiler stderr:
 
Using cached compile:
Cached command line:  arm64-apple-darwin20.0.0-clang++ /Users/jenkins/j/workspace/release/tarball/eb40a89f6a/build/conda/envs/lsst-scipipe-12.1.0/share/eups/EupsBuildDir/Darwin/gauss2d-gbf99507273+fd8379166f/gauss2d-gbf99507273+fd8379166f/build-release/meson-private/tmpoo319ht0/testfile.cpp -E -P -ftree-vectorize -fPIC -fstack-protector-strong -O2 -pipe -stdlib=libc++ -fvisibility-inlines-hidden -fmessage-length=0 -isystem /Users/jenkins/j/workspace/release/tarball/eb40a89f6a/build/conda/envs/lsst-scipipe-12.1.0/include -D_FORTIFY_SOURCE=2 -isystem /Users/jenkins/j/workspace/release/tarball/eb40a89f6a/build/conda/envs/lsst-scipipe-12.1.0/include -mmacosx-version-min=14-arm -mmacosx-version-min=11.0 -P -O0 -fpermissive -Werror=implicit-function-declaration 

Code:
 
        #ifdef __has_include
         #if !__has_include("version")
          #error "Header 'version' could not be found"
         #endif
        #else
         #include <version>
        #endif
Cached compiler stdout:
 

Cached compiler stderr:
 
Using cached compile:
Cached command line:  arm64-apple-darwin20.0.0-clang++ /Users/jenkins/j/workspace/release/tarball/eb40a89f6a/build/conda/envs/lsst-scipipe-12.1.0/share/eups/EupsBuildDir/Darwin/gauss2d-gbf99507273+fd8379166f/gauss2d-gbf99507273+fd8379166f/build-release/meson-private/tmp8usru8gy/testfile.cpp -o /Users/jenkins/j/workspace/release/tarball/eb40a89f6a/build/conda/envs/lsst-scipipe-12.1.0/share/eups/EupsBuildDir/Darwin/gauss2d-gbf99507273+fd8379166f/gauss2d-gbf99507273+fd8379166f/build-release/meson-private/tmp8usru8gy/output.obj -c -ftree-vectorize -fPIC -fstack-protector-strong -O2 -pipe -stdlib=libc++ -fvisibility-inlines-hidden -fmessage-length=0 -isystem /Users/jenkins/j/workspace/release/tarball/eb40a89f6a/build/conda/envs/lsst-scipipe-12.1.0/include -D_FORTIFY_SOURCE=2 -isystem /Users/jenkins/j/workspace/release/tarball/eb40a89f6a/build/conda/envs/lsst-scipipe-12.1.0/include -mmacosx-version-min=14-arm -mmacosx-version-min=11.0 -O0 -fpermissive -Werror=implicit-function-declaration -Werror=unknown-warning-option -Werror=unused-command-line-argument -Werror=ignored-optimization-argument 

Code:
 
        #include <version>
        int main(void) {
            /* If it's not defined as a macro, try to use as a symbol */
            #ifndef _LIBCPP_VERSION
                _LIBCPP_VERSION;
            #endif
            return 0;
        }
Cached compiler stdout:
 
Cached compiler stderr:
 
!meson_ci!/ci_include "/Users/jenkins/j/workspace/release/tarball/eb40a89f6a/build/conda/envs/lsst-scipipe-12.1.0/share/eups/EupsBuildDir/Darwin/gauss2d-gbf99507273+fd8379166f/gauss2d-gbf99507273+fd8379166f/build-release/build.ninja"
